Debian-facile

Bienvenue sur Debian-Facile, site d'aide pour les nouveaux utilisateurs de Debian.

Vous n'êtes pas identifié(e).

#1 10-06-2020 09:12:47

Abzaho
Membre
Distrib. : Kali 2020.2
Noyau : Linux 5.6.0-kali2-amd64
Inscription : 10-06-2020

[Résolu] Erreur Make:Error 2 lors de l'installation d'un git

Bonjour !
Je suis débutant sur Linux et je suis sur Kali (non pas parce que c kool 2 hakais, mais bien parce que j'en ai besoin au niveau de mes études).

Je vous présente mon problème : J'ai installé Kali 2020.2 dans VirtualBox et plutôt que d'utiliser la connexion 'filaire' j'aimerais directement utilisé mon doongle wifi DWA-171 afin de détecter les réseaux environnants.
J'ai donc trouvé les instructions à suivre sur différents forum dont celui-ci : http://www.kali-linux.fr/forum/index.php?topic=2516.0

Cependant lors de l’exécution de :

make



J'obtiens ce message d'erreur :

make ARCH=x86_64 CROSS_COMPILE= -C /lib/modules/5.6.0-kali2-amd64/build M=/home/hugo/Bureau/rtl8812AU_8821AU_linux  modules
make[1] : on entre dans le répertoire « /usr/src/linux-headers-5.6.0-kali2-amd64 »
  CC [M]  /home/hugo/Bureau/rtl8812AU_8821AU_linux/core/rtw_cmd.o
  CC [M]  /home/hugo/Bureau/rtl8812AU_8821AU_linux/core/rtw_security.o
  CC [M]  /home/hugo/Bureau/rtl8812AU_8821AU_linux/core/rtw_debug.o
  CC [M]  /home/hugo/Bureau/rtl8812AU_8821AU_linux/core/rtw_io.o
  CC [M]  /home/hugo/Bureau/rtl8812AU_8821AU_linux/core/rtw_ioctl_query.o
  CC [M]  /home/hugo/Bureau/rtl8812AU_8821AU_linux/core/rtw_ioctl_set.o
  CC [M]  /home/hugo/Bureau/rtl8812AU_8821AU_linux/core/rtw_ieee80211.o
  CC [M]  /home/hugo/Bureau/rtl8812AU_8821AU_linux/core/rtw_mlme.o
  CC [M]  /home/hugo/Bureau/rtl8812AU_8821AU_linux/core/rtw_mlme_ext.o
  CC [M]  /home/hugo/Bureau/rtl8812AU_8821AU_linux/core/rtw_wlan_util.o
  CC [M]  /home/hugo/Bureau/rtl8812AU_8821AU_linux/core/rtw_vht.o
  CC [M]  /home/hugo/Bureau/rtl8812AU_8821AU_linux/core/rtw_pwrctrl.o
  CC [M]  /home/hugo/Bureau/rtl8812AU_8821AU_linux/core/rtw_rf.o
  CC [M]  /home/hugo/Bureau/rtl8812AU_8821AU_linux/core/rtw_recv.o
  CC [M]  /home/hugo/Bureau/rtl8812AU_8821AU_linux/core/rtw_sta_mgt.o
  CC [M]  /home/hugo/Bureau/rtl8812AU_8821AU_linux/core/rtw_ap.o
  CC [M]  /home/hugo/Bureau/rtl8812AU_8821AU_linux/core/rtw_xmit.o
  CC [M]  /home/hugo/Bureau/rtl8812AU_8821AU_linux/core/rtw_p2p.o
  CC [M]  /home/hugo/Bureau/rtl8812AU_8821AU_linux/core/rtw_tdls.o
  CC [M]  /home/hugo/Bureau/rtl8812AU_8821AU_linux/core/rtw_br_ext.o
  CC [M]  /home/hugo/Bureau/rtl8812AU_8821AU_linux/core/rtw_iol.o
  CC [M]  /home/hugo/Bureau/rtl8812AU_8821AU_linux/core/rtw_sreset.o
  CC [M]  /home/hugo/Bureau/rtl8812AU_8821AU_linux/core/rtw_btcoex.o
  CC [M]  /home/hugo/Bureau/rtl8812AU_8821AU_linux/core/rtw_beamforming.o
  CC [M]  /home/hugo/Bureau/rtl8812AU_8821AU_linux/core/rtw_odm.o
  CC [M]  /home/hugo/Bureau/rtl8812AU_8821AU_linux/core/efuse/rtw_efuse.o
  CC [M]  /home/hugo/Bureau/rtl8812AU_8821AU_linux/os_dep/osdep_service.o
  CC [M]  /home/hugo/Bureau/rtl8812AU_8821AU_linux/os_dep/linux/os_intfs.o
  CC [M]  /home/hugo/Bureau/rtl8812AU_8821AU_linux/os_dep/linux/usb_intf.o
  CC [M]  /home/hugo/Bureau/rtl8812AU_8821AU_linux/os_dep/linux/usb_ops_linux.o
  CC [M]  /home/hugo/Bureau/rtl8812AU_8821AU_linux/os_dep/linux/ioctl_linux.o
  CC [M]  /home/hugo/Bureau/rtl8812AU_8821AU_linux/os_dep/linux/xmit_linux.o
  CC [M]  /home/hugo/Bureau/rtl8812AU_8821AU_linux/os_dep/linux/mlme_linux.o
  CC [M]  /home/hugo/Bureau/rtl8812AU_8821AU_linux/os_dep/linux/recv_linux.o
  CC [M]  /home/hugo/Bureau/rtl8812AU_8821AU_linux/os_dep/linux/ioctl_cfg80211.o
  CC [M]  /home/hugo/Bureau/rtl8812AU_8821AU_linux/os_dep/linux/rtw_cfgvendor.o
  CC [M]  /home/hugo/Bureau/rtl8812AU_8821AU_linux/os_dep/linux/wifi_regd.o
  CC [M]  /home/hugo/Bureau/rtl8812AU_8821AU_linux/os_dep/linux/rtw_android.o
  CC [M]  /home/hugo/Bureau/rtl8812AU_8821AU_linux/os_dep/linux/rtw_proc.o
/home/hugo/Bureau/rtl8812AU_8821AU_linux/os_dep/linux/rtw_proc.c: In function ‘rtw_proc_create_entry’:
/home/hugo/Bureau/rtl8812AU_8821AU_linux/os_dep/linux/rtw_proc.c:73:67: error: passing argument 4 of ‘proc_create_data’ from incompatible pointer type [-Werror=incompatible-pointer-types]
   73 | ry = proc_create_data(name,  S_IFREG|S_IRUGO|S_IWUGO, parent, fops, data);
      |                                                               ^~~~
      |                                                               |
      |                                                               const struct file_operations *

In file included from /home/hugo/Bureau/rtl8812AU_8821AU_linux/include/../os_dep/linux/rtw_proc.h:23,
                 from /home/hugo/Bureau/rtl8812AU_8821AU_linux/include/osdep_intf.h:123,
                 from /home/hugo/Bureau/rtl8812AU_8821AU_linux/include/drv_types.h:107,
                 from /home/hugo/Bureau/rtl8812AU_8821AU_linux/os_dep/linux/rtw_proc.c:21:
/usr/src/linux-headers-5.6.0-kali2-common/include/linux/proc_fs.h:59:31: note: expected ‘const struct proc_ops *’ but argument is of type ‘const struct file_operations *’
   59 | extern struct proc_dir_entry *proc_create_data(const char *, umode_t,
      |                               ^~~~~~~~~~~~~~~~
cc1: all warnings being treated as errors
make[3]: *** [/usr/src/linux-headers-5.6.0-kali2-common/scripts/Makefile.build:273: /home/hugo/Bureau/rtl8812AU_8821AU_linux/os_dep/linux/rtw_proc.o] Error 1
make[2]: *** [/usr/src/linux-headers-5.6.0-kali2-common/Makefile:1704: /home/hugo/Bureau/rtl8812AU_8821AU_linux] Error 2
make[1]: *** [/usr/src/linux-headers-5.6.0-kali2-common/Makefile:180: sub-make] Error 2
make[1] : on quitte le répertoire « /usr/src/linux-headers-5.6.0-kali2-amd64 »
make: *** [Makefile:1622: modules] Error 2



Après quelques petites recherches, j'ai cru comprendre que Linux avait changé la structure de 'proc_create_data', ce qui causait donc une erreur dans le make car il donnait trop d'arguments lors de l'appel de la fonction. Malheuresement je n'ai trouvé aucune aide efficace quant à la résolution de ce problème. kernal_panic.gif

Je fais donc appel à votre expertise ! help.gif
Ce problème a l'air de toucher pas mal de gens, donc j'espère qu'un utilisateur saura m'aider !

merci.gif

Dernière modification par Abzaho (10-06-2020 14:07:25)

Hors ligne

#2 10-06-2020 10:34:42

èfpé
Membre
Inscription : 10-07-2016

Re : [Résolu] Erreur Make:Error 2 lors de l'installation d'un git

Bonjour Abzaho, et bienvenue donc,

Abzaho a écrit :

J'ai donc trouvé les instructions à suivre sur différents forums dont celui-ci : http://www.kali-linux.fr/forum/index.php?topic=2516.0


Le tuto date de 2016 or depuis avril 2017 il y a un paquet realtek-rtl88xxau-dkms dans les dépôts :

apt install realtek-rtl88xxau-dkms


Assure-toi que le système est à jour avant d'installer ce paquet, en particulier le noyau/les en-têtes.

Hors ligne

#3 10-06-2020 11:06:33

Abzaho
Membre
Distrib. : Kali 2020.2
Noyau : Linux 5.6.0-kali2-amd64
Inscription : 10-06-2020

Re : [Résolu] Erreur Make:Error 2 lors de l'installation d'un git

Pour commencer merci pour ta réponse si rapide !

Très bien donc l'installation a fonctionné mais maintenant que dois-je faire ? C'est juste du plug and play ?
Si je branche mon doongle ils est bien reconnu :

lsusb


Bus 001 Device 004: ID 2001:331d D-Link Corp. DWA-171
Bus 001 Device 002: ID 80ee:0021 VirtualBox USB Tablet
Bus 001 Device 001: ID 1d6b:0001 Linux Foundation 1.1 root hub



Mais rien d'autre ne se passe, si je lance un ifconfig :

sudo ifconfig


eth0: flags=4163<UP,BROADCAST,RUNNING,MULTICAST>  mtu 1500
        inet 192.168.43.129  netmask 255.255.255.0  broadcast 192.168.43.255
        inet6 fe80::a00:27ff:fe78:e9fc  prefixlen 64  scopeid 0x20<link>
        ether 08:00:27:78:e9:fc  txqueuelen 1000  (Ethernet)
        RX packets 1674  bytes 1940546 (1.8 MiB)
        RX errors 0  dropped 0  overruns 0  frame 0
        TX packets 435  bytes 28893 (28.2 KiB)
        TX errors 0  dropped 0 overruns 0  carrier 0  collisions 0

lo: flags=73<UP,LOOPBACK,RUNNING>  mtu 65536
        inet 127.0.0.1  netmask 255.0.0.0
        inet6 ::1  prefixlen 128  scopeid 0x10<host>
        loop  txqueuelen 1000  (Boucle locale)
        RX packets 20  bytes 1144 (1.1 KiB)
        RX errors 0  dropped 0  overruns 0  frame 0
        TX packets 20  bytes 1144 (1.1 KiB)
        TX errors 0  dropped 0 overruns 0  carrier 0  collisions 0



Et j'ai pensé à un modprobe mais je ne trouve pas le module qu'il me faut

lsmod


Module                  Size  Used by
fuse                  139264  3
rfkill                 28672  2
vboxsf                 94208  0
snd_intel8x0           49152  2
snd_ac97_codec        155648  1 snd_intel8x0
ac97_bus               16384  1 snd_ac97_codec
snd_pcm               131072  2 snd_intel8x0,snd_ac97_codec
snd_timer              45056  1 snd_pcm
serio_raw              20480  0
edac_mce_amd           32768  0
pcspkr                 16384  0
snd                   106496  8 snd_intel8x0,snd_timer,snd_ac97_codec,snd_pcm
joydev                 28672  0
vboxguest             380928  6 vboxsf
sg                     36864  0
evdev                  28672  10
soundcore              16384  1 snd
ac                     16384  0
binfmt_misc            24576  1
sunrpc                499712  1
ip_tables              32768  0
x_tables               53248  1 ip_tables
autofs4                53248  2
ext4                  778240  1
crc16                  16384  1 ext4
mbcache                16384  1 ext4
jbd2                  139264  1 ext4
crc32c_generic         16384  0
hid_generic            16384  0
usbhid                 65536  0
hid                   147456  2 usbhid,hid_generic
sd_mod                 57344  3
t10_pi                 16384  1 sd_mod
crc_t10dif             20480  1 t10_pi
sr_mod                 28672  0
cdrom                  73728  1 sr_mod
crct10dif_generic      16384  0
ata_generic            16384  0
crct10dif_pclmul       16384  1
crct10dif_common       16384  3 crct10dif_generic,crc_t10dif,crct10dif_pclmul
crc32_pclmul           16384  0
crc32c_intel           24576  2
ghash_clmulni_intel    16384  0
ohci_pci               20480  0
ehci_pci               20480  0
aesni_intel           368640  0
libaes                 16384  1 aesni_intel
crypto_simd            16384  1 aesni_intel
cryptd                 24576  2 crypto_simd,ghash_clmulni_intel
glue_helper            16384  1 aesni_intel
ahci                   40960  2
psmouse               180224  0
libahci                45056  1 ahci
vmwgfx                364544  3
i2c_piix4              28672  0
ttm                   122880  1 vmwgfx
ohci_hcd               61440  1 ohci_pci
ehci_hcd               98304  1 ehci_pci
ata_piix               36864  0
drm_kms_helper        245760  1 vmwgfx
usbcore               315392  5 ohci_hcd,ehci_pci,usbhid,ehci_hcd,ohci_pci
cec                    61440  1 drm_kms_helper
e1000                 155648  0
usb_common             16384  3 ohci_hcd,usbcore,ehci_hcd
libata                290816  4 ata_piix,libahci,ahci,ata_generic
drm                   598016  6 vmwgfx,drm_kms_helper,ttm
scsi_mod              253952  4 sd_mod,libata,sg,sr_mod
video                  53248  0
button                 24576  0
 



Est-ce normal ?

Hors ligne

#4 10-06-2020 12:36:42

èfpé
Membre
Inscription : 10-07-2016

Re : [Résolu] Erreur Make:Error 2 lors de l'installation d'un git

Re-,

Abzaho a écrit :

lsusb -d 2001:

Bus 001 Device 004: ID 2001:331d D-Link Corp. DWA-171


Damned on aurait dû commencer par ça... cet adaptateur n'est pas pris en charge par ledit module :

/sbin/modinfo -F alias 88XXau |grep 331

usb:v2001p331Ad*dc*dsc*dp*ic*isc*ip*in*
usb:v2001p3318d*dc*dsc*dp*ic*isc*ip*in*
usb:v2001p3314d*dc*dsc*dp*ic*isc*ip*in*
usb:v2001p3316d*dc*dsc*dp*ic*isc*ip*in*
usb:v2001p3315d*dc*dsc*dp*ic*isc*ip*in*
usb:v2001p3313d*dc*dsc*dp*ic*isc*ip*in*
usb:v2001p3313d*dc*dsc*dp*ic*isc*ip*in*


Le PID 331D n'est pas là, peux-tu tenter le chargement du module (et poster la version matérielle) ?

Dernière modification par èfpé (10-06-2020 14:36:42)

Hors ligne

#5 10-06-2020 12:44:03

Abzaho
Membre
Distrib. : Kali 2020.2
Noyau : Linux 5.6.0-kali2-amd64
Inscription : 10-06-2020

Re : [Résolu] Erreur Make:Error 2 lors de l'installation d'un git

Je suis pas sûr d'avoir compris ce que tu me demandes scratchhead.gif

Hors ligne

#6 10-06-2020 12:54:42

èfpé
Membre
Inscription : 10-07-2016

Re : [Résolu] Erreur Make:Error 2 lors de l'installation d'un git

Re-,

Abzaho a écrit :

lsusb -d 2001:

Bus 001 Device 004: ID 2001:331d D-Link Corp. DWA-171


La version C (0x331d) du DWA-171 est basée sur le contrôleur RTL8821C ; installe le pilote D-Link.

Dernière modification par èfpé (10-06-2020 13:54:42)

Hors ligne

#7 10-06-2020 12:56:47

Abzaho
Membre
Distrib. : Kali 2020.2
Noyau : Linux 5.6.0-kali2-amd64
Inscription : 10-06-2020

Re : [Résolu] Erreur Make:Error 2 lors de l'installation d'un git

Okay donc en effet j'avais bien compris ce que tu me demandais, j'ai donc suivi la procédure j'ai décompressé le fichier tar et quand j'essaye de complier le module :

make


/bin/sh: 1: bc: not found
make ARCH=x86_64 CROSS_COMPILE= -C /lib/modules/5.6.0-kali2-amd64/build M=/home/hugo/rtl8821CU_WiFi_linux_v5.8.1_34171.20190628_COEX20190509-4141  modules
make[1] : on entre dans le répertoire « /usr/src/linux-headers-5.6.0-kali2-amd64 »
/bin/sh: 1: bc: not found
  CC [M]  /home/hugo/rtl8821CU_WiFi_linux_v5.8.1_34171.20190628_COEX20190509-4141/core/rtw_cmd.o
  CC [M]  /home/hugo/rtl8821CU_WiFi_linux_v5.8.1_34171.20190628_COEX20190509-4141/core/rtw_security.o
  CC [M]  /home/hugo/rtl8821CU_WiFi_linux_v5.8.1_34171.20190628_COEX20190509-4141/core/rtw_debug.o
/home/hugo/rtl8821CU_WiFi_linux_v5.8.1_34171.20190628_COEX20190509-4141/core/rtw_debug.c: In function ‘dump_drv_version’:
/home/hugo/rtl8821CU_WiFi_linux_v5.8.1_34171.20190628_COEX20190509-4141/core/rtw_debug.c:45:62: error: macro "__DATE__" might prevent reproducible builds [-Werror=date-time]
   45 |  RTW_PRINT_SEL(sel, "build time: %s %s\n", __DATE__, __TIME__);
      |                                                              ^
In file included from /home/hugo/rtl8821CU_WiFi_linux_v5.8.1_34171.20190628_COEX20190509-4141/include/drv_types.h:60,
                 from /home/hugo/rtl8821CU_WiFi_linux_v5.8.1_34171.20190628_COEX20190509-4141/core/rtw_debug.c:17:
/home/hugo/rtl8821CU_WiFi_linux_v5.8.1_34171.20190628_COEX20190509-4141/core/rtw_debug.c:45:44: error: macro "__TIME__" might prevent reproducible builds [-Werror=date-time]
   45 |  RTW_PRINT_SEL(sel, "build time: %s %s\n", __DATE__, __TIME__);
      |                                            ^~~~~~~~
/home/hugo/rtl8821CU_WiFi_linux_v5.8.1_34171.20190628_COEX20190509-4141/include/rtw_debug.h:114:34: note: in definition of macro ‘RTW_PRINT’
  114 |    _dbgdump(DRIVER_PREFIX fmt, ##arg);\
      |                                  ^~~
/home/hugo/rtl8821CU_WiFi_linux_v5.8.1_34171.20190628_COEX20190509-4141/core/rtw_debug.c:45:2: note: in expansion of macro ‘RTW_PRINT_SEL’
   45 |  RTW_PRINT_SEL(sel, "build time: %s %s\n", __DATE__, __TIME__);
      |  ^~~~~~~~~~~~~
/home/hugo/rtl8821CU_WiFi_linux_v5.8.1_34171.20190628_COEX20190509-4141/core/rtw_debug.c:45:54: error: macro "__DATE__" might prevent reproducible builds [-Werror=date-time]
   45 |  RTW_PRINT_SEL(sel, "build time: %s %s\n", __DATE__, __TIME__);
      |                                                      ^~~~~~~~
/home/hugo/rtl8821CU_WiFi_linux_v5.8.1_34171.20190628_COEX20190509-4141/include/rtw_debug.h:114:34: note: in definition of macro ‘RTW_PRINT’
  114 |    _dbgdump(DRIVER_PREFIX fmt, ##arg);\
      |                                  ^~~
/home/hugo/rtl8821CU_WiFi_linux_v5.8.1_34171.20190628_COEX20190509-4141/core/rtw_debug.c:45:2: note: in expansion of macro ‘RTW_PRINT_SEL’
   45 |  RTW_PRINT_SEL(sel, "build time: %s %s\n", __DATE__, __TIME__);
      |  ^~~~~~~~~~~~~
/home/hugo/rtl8821CU_WiFi_linux_v5.8.1_34171.20190628_COEX20190509-4141/core/rtw_debug.c:45:44: error: macro "__TIME__" might prevent reproducible builds [-Werror=date-time]
   45 |  RTW_PRINT_SEL(sel, "build time: %s %s\n", __DATE__, __TIME__);
      |                                            ^~~~~~~~
/home/hugo/rtl8821CU_WiFi_linux_v5.8.1_34171.20190628_COEX20190509-4141/include/rtw_debug.h:224:25: note: in definition of macro ‘RTW_PRINT_SEL’
  224 |    _seqdump(sel, fmt, ##arg) /*rtw_warn_on(1)*/; \
      |                         ^~~
cc1: some warnings being treated as errors
make[3]: *** [/usr/src/linux-headers-5.6.0-kali2-common/scripts/Makefile.build:273: /home/hugo/rtl8821CU_WiFi_linux_v5.8.1_34171.20190628_COEX20190509-4141/core/rtw_debug.o] Error 1
make[2]: *** [/usr/src/linux-headers-5.6.0-kali2-common/Makefile:1704: /home/hugo/rtl8821CU_WiFi_linux_v5.8.1_34171.20190628_COEX20190509-4141] Error 2
make[1]: *** [/usr/src/linux-headers-5.6.0-kali2-common/Makefile:180: sub-make] Error 2
make[1] : on quitte le répertoire « /usr/src/linux-headers-5.6.0-kali2-amd64 »
make: *** [Makefile:2327: modules] Error 2



On en revient au même problème ...

Hors ligne

#8 10-06-2020 13:06:42

èfpé
Membre
Inscription : 10-07-2016

Re : [Résolu] Erreur Make:Error 2 lors de l'installation d'un git

Re-,

Abzaho a écrit :

make

/bin/sh: 1: bc: not found


Pas tout à fait le même problème : commence par installer le paquet bc puis reprends la compilation.

Hors ligne

#9 10-06-2020 13:13:16

Abzaho
Membre
Distrib. : Kali 2020.2
Noyau : Linux 5.6.0-kali2-amd64
Inscription : 10-06-2020

Re : [Résolu] Erreur Make:Error 2 lors de l'installation d'un git

J'ai eu l"espoir ! j'ai donc installé bc puis relancer le make, ça s'annonçait bien tout avait l'air de bien se dérouler pour finalement  arriver à :

make ARCH=x86_64 CROSS_COMPILE= -C /lib/modules/5.6.0-kali2-amd64/build M=/home/hugo/rtl8821CU_WiFi_linux_v5.8.1_34171.20190628_COEX20190509-4141  modules
make[1] : on entre dans le répertoire « /usr/src/linux-headers-5.6.0-kali2-amd64 »
  CC [M]  /home/hugo/rtl8821CU_WiFi_linux_v5.8.1_34171.20190628_COEX20190509-4141/core/rtw_cmd.o
  CC [M]  /home/hugo/rtl8821CU_WiFi_linux_v5.8.1_34171.20190628_COEX20190509-4141/core/rtw_security.o
  CC [M]  /home/hugo/rtl8821CU_WiFi_linux_v5.8.1_34171.20190628_COEX20190509-4141/core/rtw_debug.o
  CC [M]  /home/hugo/rtl8821CU_WiFi_linux_v5.8.1_34171.20190628_COEX20190509-4141/core/rtw_io.o
  CC [M]  /home/hugo/rtl8821CU_WiFi_linux_v5.8.1_34171.20190628_COEX20190509-4141/core/rtw_ioctl_query.o
  CC [M]  /home/hugo/rtl8821CU_WiFi_linux_v5.8.1_34171.20190628_COEX20190509-4141/core/rtw_ioctl_set.o
  CC [M]  /home/hugo/rtl8821CU_WiFi_linux_v5.8.1_34171.20190628_COEX20190509-4141/core/rtw_ieee80211.o
  CC [M]  /home/hugo/rtl8821CU_WiFi_linux_v5.8.1_34171.20190628_COEX20190509-4141/core/rtw_mlme.o
  CC [M]  /home/hugo/rtl8821CU_WiFi_linux_v5.8.1_34171.20190628_COEX20190509-4141/core/rtw_mlme_ext.o
/home/hugo/rtl8821CU_WiFi_linux_v5.8.1_34171.20190628_COEX20190509-4141/core/rtw_mlme_ext.c: In function ‘rtw_txpwr_init_regd’:
/home/hugo/rtl8821CU_WiFi_linux_v5.8.1_34171.20190628_COEX20190509-4141/core/rtw_mlme_ext.c:260:6: warning: this statement may fall through [-Wimplicit-fallthrough=]
  260 |   if (rfctl->regd_name)
      |      ^
/home/hugo/rtl8821CU_WiFi_linux_v5.8.1_34171.20190628_COEX20190509-4141/core/rtw_mlme_ext.c:262:2: note: here
  262 |  default:
      |  ^~~~~~~
/home/hugo/rtl8821CU_WiFi_linux_v5.8.1_34171.20190628_COEX20190509-4141/core/rtw_mlme_ext.c: In function ‘mgt_dispatcher’:
/home/hugo/rtl8821CU_WiFi_linux_v5.8.1_34171.20190628_COEX20190509-4141/core/rtw_mlme_ext.c:1349:17: warning: this statement may fall through [-Wimplicit-fallthrough=]
 1349 |    ptable->func = &OnAuthClient;
      |    ~~~~~~~~~~~~~^~~~~~~~~~~~~~~
/home/hugo/rtl8821CU_WiFi_linux_v5.8.1_34171.20190628_COEX20190509-4141/core/rtw_mlme_ext.c:1351:2: note: here
 1351 |  case WIFI_ASSOCREQ:
      |  ^~~~
  CC [M]  /home/hugo/rtl8821CU_WiFi_linux_v5.8.1_34171.20190628_COEX20190509-4141/core/rtw_mi.o
  CC [M]  /home/hugo/rtl8821CU_WiFi_linux_v5.8.1_34171.20190628_COEX20190509-4141/core/rtw_wlan_util.o
  CC [M]  /home/hugo/rtl8821CU_WiFi_linux_v5.8.1_34171.20190628_COEX20190509-4141/core/rtw_vht.o
  CC [M]  /home/hugo/rtl8821CU_WiFi_linux_v5.8.1_34171.20190628_COEX20190509-4141/core/rtw_pwrctrl.o
  CC [M]  /home/hugo/rtl8821CU_WiFi_linux_v5.8.1_34171.20190628_COEX20190509-4141/core/rtw_rf.o
  CC [M]  /home/hugo/rtl8821CU_WiFi_linux_v5.8.1_34171.20190628_COEX20190509-4141/core/rtw_chplan.o
  CC [M]  /home/hugo/rtl8821CU_WiFi_linux_v5.8.1_34171.20190628_COEX20190509-4141/core/rtw_recv.o
  CC [M]  /home/hugo/rtl8821CU_WiFi_linux_v5.8.1_34171.20190628_COEX20190509-4141/core/rtw_sta_mgt.o
  CC [M]  /home/hugo/rtl8821CU_WiFi_linux_v5.8.1_34171.20190628_COEX20190509-4141/core/rtw_ap.o
  CC [M]  /home/hugo/rtl8821CU_WiFi_linux_v5.8.1_34171.20190628_COEX20190509-4141/core/mesh/rtw_mesh.o
  CC [M]  /home/hugo/rtl8821CU_WiFi_linux_v5.8.1_34171.20190628_COEX20190509-4141/core/mesh/rtw_mesh_pathtbl.o
  CC [M]  /home/hugo/rtl8821CU_WiFi_linux_v5.8.1_34171.20190628_COEX20190509-4141/core/mesh/rtw_mesh_hwmp.o
  CC [M]  /home/hugo/rtl8821CU_WiFi_linux_v5.8.1_34171.20190628_COEX20190509-4141/core/rtw_xmit.o
  CC [M]  /home/hugo/rtl8821CU_WiFi_linux_v5.8.1_34171.20190628_COEX20190509-4141/core/rtw_p2p.o
  CC [M]  /home/hugo/rtl8821CU_WiFi_linux_v5.8.1_34171.20190628_COEX20190509-4141/core/rtw_rson.o
  CC [M]  /home/hugo/rtl8821CU_WiFi_linux_v5.8.1_34171.20190628_COEX20190509-4141/core/rtw_tdls.o
  CC [M]  /home/hugo/rtl8821CU_WiFi_linux_v5.8.1_34171.20190628_COEX20190509-4141/core/rtw_br_ext.o
  CC [M]  /home/hugo/rtl8821CU_WiFi_linux_v5.8.1_34171.20190628_COEX20190509-4141/core/rtw_iol.o
  CC [M]  /home/hugo/rtl8821CU_WiFi_linux_v5.8.1_34171.20190628_COEX20190509-4141/core/rtw_sreset.o
  CC [M]  /home/hugo/rtl8821CU_WiFi_linux_v5.8.1_34171.20190628_COEX20190509-4141/core/rtw_btcoex_wifionly.o
  CC [M]  /home/hugo/rtl8821CU_WiFi_linux_v5.8.1_34171.20190628_COEX20190509-4141/core/rtw_btcoex.o
  CC [M]  /home/hugo/rtl8821CU_WiFi_linux_v5.8.1_34171.20190628_COEX20190509-4141/core/rtw_beamforming.o
  CC [M]  /home/hugo/rtl8821CU_WiFi_linux_v5.8.1_34171.20190628_COEX20190509-4141/core/rtw_odm.o
  CC [M]  /home/hugo/rtl8821CU_WiFi_linux_v5.8.1_34171.20190628_COEX20190509-4141/core/rtw_rm.o
  CC [M]  /home/hugo/rtl8821CU_WiFi_linux_v5.8.1_34171.20190628_COEX20190509-4141/core/rtw_rm_fsm.o
  CC [M]  /home/hugo/rtl8821CU_WiFi_linux_v5.8.1_34171.20190628_COEX20190509-4141/core/rtw_rm_util.o
  CC [M]  /home/hugo/rtl8821CU_WiFi_linux_v5.8.1_34171.20190628_COEX20190509-4141/core/efuse/rtw_efuse.o
  CC [M]  /home/hugo/rtl8821CU_WiFi_linux_v5.8.1_34171.20190628_COEX20190509-4141/os_dep/osdep_service.o
  CC [M]  /home/hugo/rtl8821CU_WiFi_linux_v5.8.1_34171.20190628_COEX20190509-4141/os_dep/linux/os_intfs.o
/home/hugo/rtl8821CU_WiFi_linux_v5.8.1_34171.20190628_COEX20190509-4141/os_dep/linux/os_intfs.c:1707:22: error: initialization of ‘u16 (*)(struct net_device *, struct sk_buff *, struct net_device *)’ {aka ‘short unsigned int (*)(struct net_device *, struct sk_buff *, struct net_device *)’} from incompatible pointer type ‘u16 (*)(struct net_device *, struct sk_buff *, struct net_device *, u16 (*)(struct net_device *, struct sk_buff *, struct net_device *))’ {aka ‘short unsigned int (*)(struct net_device *, struct sk_buff *, struct net_device *, short unsigned int (*)(struct net_device *, struct sk_buff *, struct net_device *))’} [-Werror=incompatible-pointer-types]
 1707 |  .ndo_select_queue = rtw_select_queue,
      |                      ^~~~~~~~~~~~~~~~
/home/hugo/rtl8821CU_WiFi_linux_v5.8.1_34171.20190628_COEX20190509-4141/os_dep/linux/os_intfs.c:1707:22: note: (near initialization for ‘rtw_netdev_ops.ndo_select_queue’)
cc1: some warnings being treated as errors
make[3]: *** [/usr/src/linux-headers-5.6.0-kali2-common/scripts/Makefile.build:273: /home/hugo/rtl8821CU_WiFi_linux_v5.8.1_34171.20190628_COEX20190509-4141/os_dep/linux/os_intfs.o] Error 1
make[2]: *** [/usr/src/linux-headers-5.6.0-kali2-common/Makefile:1704: /home/hugo/rtl8821CU_WiFi_linux_v5.8.1_34171.20190628_COEX20190509-4141] Error 2
make[1]: *** [/usr/src/linux-headers-5.6.0-kali2-common/Makefile:180: sub-make] Error 2
make[1] : on quitte le répertoire « /usr/src/linux-headers-5.6.0-kali2-amd64 »
make: *** [Makefile:2327: modules] Error 2
 

Hors ligne

#10 10-06-2020 13:28:42

èfpé
Membre
Inscription : 10-07-2016

Re : [Résolu] Erreur Make:Error 2 lors de l'installation d'un git

Re-,

Abzaho a écrit :

J'ai eu l"espoir !


Tout espoir n'est pas perdu... Tente une version GitHub du pilote Realtek ; celle de brektrou, par ex.

Hors ligne

#11 10-06-2020 13:44:22

Abzaho
Membre
Distrib. : Kali 2020.2
Noyau : Linux 5.6.0-kali2-amd64
Inscription : 10-06-2020

Re : [Résolu] Erreur Make:Error 2 lors de l'installation d'un git

Okay donc j'ai bien cloné le git, lorsque j'ai essayé avec le make ça faisait beaucoup de choses et après avoir lancé make install, lorsque la commande s'est terminée je n'ai pas vu grand chose de différent.

J'ai donc lancé le dkms-install.sh qui se trouvait dans le git et après avoir terminé le module "8821cu" était apparu dans lsmod ! Après ça j'ai fais :

modprobe 8821cu



et aucune réponse, et si je branche ou débranche mon périphérique rien ne se passe ..

Hors ligne

#12 10-06-2020 14:05:30

Abzaho
Membre
Distrib. : Kali 2020.2
Noyau : Linux 5.6.0-kali2-amd64
Inscription : 10-06-2020

Re : [Résolu] Erreur Make:Error 2 lors de l'installation d'un git

YES !

J'ai suivi les instructions qu'il y a marqué dans le readme du git et ça fonctionne ! j'ai pas l'air de capter avec un grande portée mais je capte tout de même donc c'est bon !

Merci infiniment tu m'as beaucoup aidé c'est très sympathique de ta part !
merci.gifmerci.gifmerci.gifmerci.gif

Hors ligne

Pied de page des forums