Debian Debian-France Debian-Facile Debian-fr.org Debian-fr.xyz Debian ? Communautés

Debian-facile

Bienvenue sur Debian-Facile, site d'aide pour les nouveaux utilisateurs de Debian.

Vous n'êtes pas identifié(e).

#1 07-05-2021 13:43:53

82(_)|\|0
Adhérent(e)
Lieu : 36300 LE BLANC
Distrib. : Linux 5.10.0-6-amd64 bullseye/sid
Noyau : #1 SMP Debian 5.10.28-1 (2021-04-09)
(G)UI : SDDM - Kwin - KDE - Plasma
Inscription : 24-04-2021

[Non-Résolu] Installer le Dock I-Tec USB 3.0 sur ThinkPad P14S

Bonjour,

J'ai suivi la procédure d'installation en commençant par le téléchargement sur :
https://www.synaptics.com/products/disp … letype=exe
Je me suis rendu dans le répertoire du téléchargement

cd /répertoire/du/téléchargement/


J'ai décompressé l'archive téléchargée :

unzip DisplayLink_Ubuntu_5.3.1.zip

]
Rendu le fichier exécutable :

sudo chmod +x displaylink-driver-5.3.1.34.run


Puis exécuté le fichier :

sudo ./displaylink-driver-5.3.1.34.run


J'obtiens :

Verifying archive integrity...  100%   All good.
Uncompressing DisplayLink Linux Driver 5.3.1.34  100%  
DisplayLink Linux Software 5.3.1.34 install script called:
Distribution discovered: Debian GNU/Linux bullseye/sid

Installing

[ Installing EVDI ]
[[ Installing EVDI DKMS module ]]

Creating symlink /var/lib/dkms/evdi/1.7.0/source ->
                 /usr/src/evdi-1.7.0

DKMS: add completed.

Kernel preparation unnecessary for this kernel.  Skipping...

Building module:
cleaning build area...
make -j16 KERNELRELEASE=5.10.0-6-amd64 all INCLUDEDIR=/lib/modules/5.10.0-6-amd64/build/include KVERSION=5.10.0-6-amd64 DKMS_BUILD=1...(bad exit status: 2)
Error! Bad return status for module build on kernel: 5.10.0-6-amd64 (x86_64)
Consult /var/lib/dkms/evdi/1.7.0/build/make.log for more information.
ERROR: Failed to install evdi/5.3.1.34 to the kernel tree.



Je vais donc voir le fichier indiqué :

sudo gedit /var/lib/dkms/evdi/1.7.0/build/make.log


qui affiche :

DKMS make.log for evdi-1.7.0 for kernel 5.10.0-6-amd64 (x86_64)
Fri May  7 08:04:36 CEST 2021
make KBUILD_VERBOSE=1 M=/var/lib/dkms/evdi/1.7.0/build SUBDIRS=/var/lib/dkms/evdi/1.7.0/build SRCROOT=/var/lib/dkms/evdi/1.7.0/build CONFIG_MODULE_SIG= -C /lib/modules/5.10.0-6-amd64/build modules
make[1]: Entering directory '/usr/src/linux-headers-5.10.0-6-amd64'
make -C /usr/src/linux-headers-5.10.0-6-amd64 -f /usr/src/linux-headers-5.10.0-6-common/Makefile modules
test -e include/generated/autoconf.h -a -e include/config/auto.conf || (    \
echo >&2;             \
echo >&2 "  ERROR: Kernel configuration is invalid.";   \
echo >&2 "         include/generated/autoconf.h or include/config/auto.conf are missing.";\
echo >&2 "         Run 'make oldconfig && make prepare' on kernel src to fix it.";  \
echo >&2 ;              \
/bin/false)
make -f /usr/src/linux-headers-5.10.0-6-common/scripts/Makefile.build obj=/var/lib/dkms/evdi/1.7.0/build \
single-build= \
need-builtin=1 need-modorder=1
   gcc-10 -Wp,-MMD,/var/lib/dkms/evdi/1.7.0/build/.evdi_drv.o.d -nostdinc -isystem /usr/lib/gcc/x86_64-linux-gnu/10/include -I/usr/src/linux-headers-5.10.0-6-common/arch/x86/include -I./arch/x86/include/generated -I/usr/src/linux-headers-5.10.0-6-common/include -I./include -I/usr/src/linux-headers-5.10.0-6-common/arch/x86/include/uapi -I./arch/x86/include/generated/uapi -I/usr/src/linux-headers-5.10.0-6-common/include/uapi -I./include/generated/uapi -include /usr/src/linux-headers-5.10.0-6-common/include/linux/kconfig.h -include /usr/src/linux-headers-5.10.0-6-common/include/linux/compiler_types.h -D__KERNEL__ -fmacro-prefix-map=/usr/src/linux-headers-5.10.0-6-common/= -Wall -Wundef -Werror=strict-prototypes -Wno-trigraphs -fno-strict-aliasing -fno-common -fshort-wchar -fno-PIE -Werror=implicit-function-declaration -Werror=implicit-int -Werror=return-type -Wno-format-security -std=gnu89 -mno-sse -mno-mmx -mno-sse2 -mno-3dnow -mno-avx -fcf-protection=none -m64 -falign-jumps=1 -falign-loops=1 -mno-80387 -mno-fp-ret-in-387 -mpreferred-stack-boundary=3 -mskip-rax-setup -mtune=generic -mno-red-zone -mcmodel=kernel -DCONFIG_X86_X32_ABI -Wno-sign-compare -fno-asynchronous-unwind-tables -mindirect-branch=thunk-extern -mindirect-branch-register -fno-jump-tables -fno-delete-null-pointer-checks -Wno-frame-address -Wno-format-truncation -Wno-format-overflow -Wno-address-of-packed-member -O2 -fno-allow-store-data-races -Wframe-larger-than=2048 -fstack-protector-strong -Wno-unused-but-set-variable -Wimplicit-fallthrough -Wno-unused-const-variable -g -pg -mrecord-mcount -mfentry -DCC_USING_FENTRY -Wdeclaration-after-statement -Wvla -Wno-pointer-sign -Wno-stringop-truncation -Wno-zero-length-bounds -Wno-array-bounds -Wno-stringop-overflow -Wno-restrict -Wno-maybe-uninitialized -fno-strict-overflow -fno-stack-check -fconserve-stack -Werror=date-time -Werror=incompatible-pointer-types -Werror=designated-init -Wno-packed-not-aligned -Iinclude/drm  -DMODULE  -DKBUILD_BASENAME='"evdi_drv"' -DKBUILD_MODNAME='"evdi"' -c -o /var/lib/dkms/evdi/1.7.0/build/evdi_drv.o /var/lib/dkms/evdi/1.7.0/build/evdi_drv.c
   gcc-10 -Wp,-MMD,/var/lib/dkms/evdi/1.7.0/build/.evdi_modeset.o.d -nostdinc -isystem /usr/lib/gcc/x86_64-linux-gnu/10/include -I/usr/src/linux-headers-5.10.0-6-common/arch/x86/include -I./arch/x86/include/generated -I/usr/src/linux-headers-5.10.0-6-common/include -I./include -I/usr/src/linux-headers-5.10.0-6-common/arch/x86/include/uapi -I./arch/x86/include/generated/uapi -I/usr/src/linux-headers-5.10.0-6-common/include/uapi -I./include/generated/uapi -include /usr/src/linux-headers-5.10.0-6-common/include/linux/kconfig.h -include /usr/src/linux-headers-5.10.0-6-common/include/linux/compiler_types.h -D__KERNEL__ -fmacro-prefix-map=/usr/src/linux-headers-5.10.0-6-common/= -Wall -Wundef -Werror=strict-prototypes -Wno-trigraphs -fno-strict-aliasing -fno-common -fshort-wchar -fno-PIE -Werror=implicit-function-declaration -Werror=implicit-int -Werror=return-type -Wno-format-security -std=gnu89 -mno-sse -mno-mmx -mno-sse2 -mno-3dnow -mno-avx -fcf-protection=none -m64 -falign-jumps=1 -falign-loops=1 -mno-80387 -mno-fp-ret-in-387 -mpreferred-stack-boundary=3 -mskip-rax-setup -mtune=generic -mno-red-zone -mcmodel=kernel -DCONFIG_X86_X32_ABI -Wno-sign-compare -fno-asynchronous-unwind-tables -mindirect-branch=thunk-extern -mindirect-branch-register -fno-jump-tables -fno-delete-null-pointer-checks -Wno-frame-address -Wno-format-truncation -Wno-format-overflow -Wno-address-of-packed-member -O2 -fno-allow-store-data-races -Wframe-larger-than=2048 -fstack-protector-strong -Wno-unused-but-set-variable -Wimplicit-fallthrough -Wno-unused-const-variable -g -pg -mrecord-mcount -mfentry -DCC_USING_FENTRY -Wdeclaration-after-statement -Wvla -Wno-pointer-sign -Wno-stringop-truncation -Wno-zero-length-bounds -Wno-array-bounds -Wno-stringop-overflow -Wno-restrict -Wno-maybe-uninitialized -fno-strict-overflow -fno-stack-check -fconserve-stack -Werror=date-time -Werror=incompatible-pointer-types -Werror=designated-init -Wno-packed-not-aligned -Iinclude/drm  -DMODULE  -DKBUILD_BASENAME='"evdi_modeset"' -DKBUILD_MODNAME='"evdi"' -c -o /var/lib/dkms/evdi/1.7.0/build/evdi_modeset.o /var/lib/dkms/evdi/1.7.0/build/evdi_modeset.c
   gcc-10 -Wp,-MMD,/var/lib/dkms/evdi/1.7.0/build/.evdi_connector.o.d -nostdinc -isystem /usr/lib/gcc/x86_64-linux-gnu/10/include -I/usr/src/linux-headers-5.10.0-6-common/arch/x86/include -I./arch/x86/include/generated -I/usr/src/linux-headers-5.10.0-6-common/include -I./include -I/usr/src/linux-headers-5.10.0-6-common/arch/x86/include/uapi -I./arch/x86/include/generated/uapi -I/usr/src/linux-headers-5.10.0-6-common/include/uapi -I./include/generated/uapi -include /usr/src/linux-headers-5.10.0-6-common/include/linux/kconfig.h -include /usr/src/linux-headers-5.10.0-6-common/include/linux/compiler_types.h -D__KERNEL__ -fmacro-prefix-map=/usr/src/linux-headers-5.10.0-6-common/= -Wall -Wundef -Werror=strict-prototypes -Wno-trigraphs -fno-strict-aliasing -fno-common -fshort-wchar -fno-PIE -Werror=implicit-function-declaration -Werror=implicit-int -Werror=return-type -Wno-format-security -std=gnu89 -mno-sse -mno-mmx -mno-sse2 -mno-3dnow -mno-avx -fcf-protection=none -m64 -falign-jumps=1 -falign-loops=1 -mno-80387 -mno-fp-ret-in-387 -mpreferred-stack-boundary=3 -mskip-rax-setup -mtune=generic -mno-red-zone -mcmodel=kernel -DCONFIG_X86_X32_ABI -Wno-sign-compare -fno-asynchronous-unwind-tables -mindirect-branch=thunk-extern -mindirect-branch-register -fno-jump-tables -fno-delete-null-pointer-checks -Wno-frame-address -Wno-format-truncation -Wno-format-overflow -Wno-address-of-packed-member -O2 -fno-allow-store-data-races -Wframe-larger-than=2048 -fstack-protector-strong -Wno-unused-but-set-variable -Wimplicit-fallthrough -Wno-unused-const-variable -g -pg -mrecord-mcount -mfentry -DCC_USING_FENTRY -Wdeclaration-after-statement -Wvla -Wno-pointer-sign -Wno-stringop-truncation -Wno-zero-length-bounds -Wno-array-bounds -Wno-stringop-overflow -Wno-restrict -Wno-maybe-uninitialized -fno-strict-overflow -fno-stack-check -fconserve-stack -Werror=date-time -Werror=incompatible-pointer-types -Werror=designated-init -Wno-packed-not-aligned -Iinclude/drm  -DMODULE  -DKBUILD_BASENAME='"evdi_connector"' -DKBUILD_MODNAME='"evdi"' -c -o /var/lib/dkms/evdi/1.7.0/build/evdi_connector.o /var/lib/dkms/evdi/1.7.0/build/evdi_connector.c
   gcc-10 -Wp,-MMD,/var/lib/dkms/evdi/1.7.0/build/.evdi_encoder.o.d -nostdinc -isystem /usr/lib/gcc/x86_64-linux-gnu/10/include -I/usr/src/linux-headers-5.10.0-6-common/arch/x86/include -I./arch/x86/include/generated -I/usr/src/linux-headers-5.10.0-6-common/include -I./include -I/usr/src/linux-headers-5.10.0-6-common/arch/x86/include/uapi -I./arch/x86/include/generated/uapi -I/usr/src/linux-headers-5.10.0-6-common/include/uapi -I./include/generated/uapi -include /usr/src/linux-headers-5.10.0-6-common/include/linux/kconfig.h -include /usr/src/linux-headers-5.10.0-6-common/include/linux/compiler_types.h -D__KERNEL__ -fmacro-prefix-map=/usr/src/linux-headers-5.10.0-6-common/= -Wall -Wundef -Werror=strict-prototypes -Wno-trigraphs -fno-strict-aliasing -fno-common -fshort-wchar -fno-PIE -Werror=implicit-function-declaration -Werror=implicit-int -Werror=return-type -Wno-format-security -std=gnu89 -mno-sse -mno-mmx -mno-sse2 -mno-3dnow -mno-avx -fcf-protection=none -m64 -falign-jumps=1 -falign-loops=1 -mno-80387 -mno-fp-ret-in-387 -mpreferred-stack-boundary=3 -mskip-rax-setup -mtune=generic -mno-red-zone -mcmodel=kernel -DCONFIG_X86_X32_ABI -Wno-sign-compare -fno-asynchronous-unwind-tables -mindirect-branch=thunk-extern -mindirect-branch-register -fno-jump-tables -fno-delete-null-pointer-checks -Wno-frame-address -Wno-format-truncation -Wno-format-overflow -Wno-address-of-packed-member -O2 -fno-allow-store-data-races -Wframe-larger-than=2048 -fstack-protector-strong -Wno-unused-but-set-variable -Wimplicit-fallthrough -Wno-unused-const-variable -g -pg -mrecord-mcount -mfentry -DCC_USING_FENTRY -Wdeclaration-after-statement -Wvla -Wno-pointer-sign -Wno-stringop-truncation -Wno-zero-length-bounds -Wno-array-bounds -Wno-stringop-overflow -Wno-restrict -Wno-maybe-uninitialized -fno-strict-overflow -fno-stack-check -fconserve-stack -Werror=date-time -Werror=incompatible-pointer-types -Werror=designated-init -Wno-packed-not-aligned -Iinclude/drm  -DMODULE  -DKBUILD_BASENAME='"evdi_encoder"' -DKBUILD_MODNAME='"evdi"' -c -o /var/lib/dkms/evdi/1.7.0/build/evdi_encoder.o /var/lib/dkms/evdi/1.7.0/build/evdi_encoder.c
   gcc-10 -Wp,-MMD,/var/lib/dkms/evdi/1.7.0/build/.evdi_main.o.d -nostdinc -isystem /usr/lib/gcc/x86_64-linux-gnu/10/include -I/usr/src/linux-headers-5.10.0-6-common/arch/x86/include -I./arch/x86/include/generated -I/usr/src/linux-headers-5.10.0-6-common/include -I./include -I/usr/src/linux-headers-5.10.0-6-common/arch/x86/include/uapi -I./arch/x86/include/generated/uapi -I/usr/src/linux-headers-5.10.0-6-common/include/uapi -I./include/generated/uapi -include /usr/src/linux-headers-5.10.0-6-common/include/linux/kconfig.h -include /usr/src/linux-headers-5.10.0-6-common/include/linux/compiler_types.h -D__KERNEL__ -fmacro-prefix-map=/usr/src/linux-headers-5.10.0-6-common/= -Wall -Wundef -Werror=strict-prototypes -Wno-trigraphs -fno-strict-aliasing -fno-common -fshort-wchar -fno-PIE -Werror=implicit-function-declaration -Werror=implicit-int -Werror=return-type -Wno-format-security -std=gnu89 -mno-sse -mno-mmx -mno-sse2 -mno-3dnow -mno-avx -fcf-protection=none -m64 -falign-jumps=1 -falign-loops=1 -mno-80387 -mno-fp-ret-in-387 -mpreferred-stack-boundary=3 -mskip-rax-setup -mtune=generic -mno-red-zone -mcmodel=kernel -DCONFIG_X86_X32_ABI -Wno-sign-compare -fno-asynchronous-unwind-tables -mindirect-branch=thunk-extern -mindirect-branch-register -fno-jump-tables -fno-delete-null-pointer-checks -Wno-frame-address -Wno-format-truncation -Wno-format-overflow -Wno-address-of-packed-member -O2 -fno-allow-store-data-races -Wframe-larger-than=2048 -fstack-protector-strong -Wno-unused-but-set-variable -Wimplicit-fallthrough -Wno-unused-const-variable -g -pg -mrecord-mcount -mfentry -DCC_USING_FENTRY -Wdeclaration-after-statement -Wvla -Wno-pointer-sign -Wno-stringop-truncation -Wno-zero-length-bounds -Wno-array-bounds -Wno-stringop-overflow -Wno-restrict -Wno-maybe-uninitialized -fno-strict-overflow -fno-stack-check -fconserve-stack -Werror=date-time -Werror=incompatible-pointer-types -Werror=designated-init -Wno-packed-not-aligned -Iinclude/drm  -DMODULE  -DKBUILD_BASENAME='"evdi_main"' -DKBUILD_MODNAME='"evdi"' -c -o /var/lib/dkms/evdi/1.7.0/build/evdi_main.o /var/lib/dkms/evdi/1.7.0/build/evdi_main.c
   gcc-10 -Wp,-MMD,/var/lib/dkms/evdi/1.7.0/build/.evdi_fb.o.d -nostdinc -isystem /usr/lib/gcc/x86_64-linux-gnu/10/include -I/usr/src/linux-headers-5.10.0-6-common/arch/x86/include -I./arch/x86/include/generated -I/usr/src/linux-headers-5.10.0-6-common/include -I./include -I/usr/src/linux-headers-5.10.0-6-common/arch/x86/include/uapi -I./arch/x86/include/generated/uapi -I/usr/src/linux-headers-5.10.0-6-common/include/uapi -I./include/generated/uapi -include /usr/src/linux-headers-5.10.0-6-common/include/linux/kconfig.h -include /usr/src/linux-headers-5.10.0-6-common/include/linux/compiler_types.h -D__KERNEL__ -fmacro-prefix-map=/usr/src/linux-headers-5.10.0-6-common/= -Wall -Wundef -Werror=strict-prototypes -Wno-trigraphs -fno-strict-aliasing -fno-common -fshort-wchar -fno-PIE -Werror=implicit-function-declaration -Werror=implicit-int -Werror=return-type -Wno-format-security -std=gnu89 -mno-sse -mno-mmx -mno-sse2 -mno-3dnow -mno-avx -fcf-protection=none -m64 -falign-jumps=1 -falign-loops=1 -mno-80387 -mno-fp-ret-in-387 -mpreferred-stack-boundary=3 -mskip-rax-setup -mtune=generic -mno-red-zone -mcmodel=kernel -DCONFIG_X86_X32_ABI -Wno-sign-compare -fno-asynchronous-unwind-tables -mindirect-branch=thunk-extern -mindirect-branch-register -fno-jump-tables -fno-delete-null-pointer-checks -Wno-frame-address -Wno-format-truncation -Wno-format-overflow -Wno-address-of-packed-member -O2 -fno-allow-store-data-races -Wframe-larger-than=2048 -fstack-protector-strong -Wno-unused-but-set-variable -Wimplicit-fallthrough -Wno-unused-const-variable -g -pg -mrecord-mcount -mfentry -DCC_USING_FENTRY -Wdeclaration-after-statement -Wvla -Wno-pointer-sign -Wno-stringop-truncation -Wno-zero-length-bounds -Wno-array-bounds -Wno-stringop-overflow -Wno-restrict -Wno-maybe-uninitialized -fno-strict-overflow -fno-stack-check -fconserve-stack -Werror=date-time -Werror=incompatible-pointer-types -Werror=designated-init -Wno-packed-not-aligned -Iinclude/drm  -DMODULE  -DKBUILD_BASENAME='"evdi_fb"' -DKBUILD_MODNAME='"evdi"' -c -o /var/lib/dkms/evdi/1.7.0/build/evdi_fb.o /var/lib/dkms/evdi/1.7.0/build/evdi_fb.c
   gcc-10 -Wp,-MMD,/var/lib/dkms/evdi/1.7.0/build/.evdi_gem.o.d -nostdinc -isystem /usr/lib/gcc/x86_64-linux-gnu/10/include -I/usr/src/linux-headers-5.10.0-6-common/arch/x86/include -I./arch/x86/include/generated -I/usr/src/linux-headers-5.10.0-6-common/include -I./include -I/usr/src/linux-headers-5.10.0-6-common/arch/x86/include/uapi -I./arch/x86/include/generated/uapi -I/usr/src/linux-headers-5.10.0-6-common/include/uapi -I./include/generated/uapi -include /usr/src/linux-headers-5.10.0-6-common/include/linux/kconfig.h -include /usr/src/linux-headers-5.10.0-6-common/include/linux/compiler_types.h -D__KERNEL__ -fmacro-prefix-map=/usr/src/linux-headers-5.10.0-6-common/= -Wall -Wundef -Werror=strict-prototypes -Wno-trigraphs -fno-strict-aliasing -fno-common -fshort-wchar -fno-PIE -Werror=implicit-function-declaration -Werror=implicit-int -Werror=return-type -Wno-format-security -std=gnu89 -mno-sse -mno-mmx -mno-sse2 -mno-3dnow -mno-avx -fcf-protection=none -m64 -falign-jumps=1 -falign-loops=1 -mno-80387 -mno-fp-ret-in-387 -mpreferred-stack-boundary=3 -mskip-rax-setup -mtune=generic -mno-red-zone -mcmodel=kernel -DCONFIG_X86_X32_ABI -Wno-sign-compare -fno-asynchronous-unwind-tables -mindirect-branch=thunk-extern -mindirect-branch-register -fno-jump-tables -fno-delete-null-pointer-checks -Wno-frame-address -Wno-format-truncation -Wno-format-overflow -Wno-address-of-packed-member -O2 -fno-allow-store-data-races -Wframe-larger-than=2048 -fstack-protector-strong -Wno-unused-but-set-variable -Wimplicit-fallthrough -Wno-unused-const-variable -g -pg -mrecord-mcount -mfentry -DCC_USING_FENTRY -Wdeclaration-after-statement -Wvla -Wno-pointer-sign -Wno-stringop-truncation -Wno-zero-length-bounds -Wno-array-bounds -Wno-stringop-overflow -Wno-restrict -Wno-maybe-uninitialized -fno-strict-overflow -fno-stack-check -fconserve-stack -Werror=date-time -Werror=incompatible-pointer-types -Werror=designated-init -Wno-packed-not-aligned -Iinclude/drm  -DMODULE  -DKBUILD_BASENAME='"evdi_gem"' -DKBUILD_MODNAME='"evdi"' -c -o /var/lib/dkms/evdi/1.7.0/build/evdi_gem.o /var/lib/dkms/evdi/1.7.0/build/evdi_gem.c
   gcc-10 -Wp,-MMD,/var/lib/dkms/evdi/1.7.0/build/.evdi_painter.o.d -nostdinc -isystem /usr/lib/gcc/x86_64-linux-gnu/10/include -I/usr/src/linux-headers-5.10.0-6-common/arch/x86/include -I./arch/x86/include/generated -I/usr/src/linux-headers-5.10.0-6-common/include -I./include -I/usr/src/linux-headers-5.10.0-6-common/arch/x86/include/uapi -I./arch/x86/include/generated/uapi -I/usr/src/linux-headers-5.10.0-6-common/include/uapi -I./include/generated/uapi -include /usr/src/linux-headers-5.10.0-6-common/include/linux/kconfig.h -include /usr/src/linux-headers-5.10.0-6-common/include/linux/compiler_types.h -D__KERNEL__ -fmacro-prefix-map=/usr/src/linux-headers-5.10.0-6-common/= -Wall -Wundef -Werror=strict-prototypes -Wno-trigraphs -fno-strict-aliasing -fno-common -fshort-wchar -fno-PIE -Werror=implicit-function-declaration -Werror=implicit-int -Werror=return-type -Wno-format-security -std=gnu89 -mno-sse -mno-mmx -mno-sse2 -mno-3dnow -mno-avx -fcf-protection=none -m64 -falign-jumps=1 -falign-loops=1 -mno-80387 -mno-fp-ret-in-387 -mpreferred-stack-boundary=3 -mskip-rax-setup -mtune=generic -mno-red-zone -mcmodel=kernel -DCONFIG_X86_X32_ABI -Wno-sign-compare -fno-asynchronous-unwind-tables -mindirect-branch=thunk-extern -mindirect-branch-register -fno-jump-tables -fno-delete-null-pointer-checks -Wno-frame-address -Wno-format-truncation -Wno-format-overflow -Wno-address-of-packed-member -O2 -fno-allow-store-data-races -Wframe-larger-than=2048 -fstack-protector-strong -Wno-unused-but-set-variable -Wimplicit-fallthrough -Wno-unused-const-variable -g -pg -mrecord-mcount -mfentry -DCC_USING_FENTRY -Wdeclaration-after-statement -Wvla -Wno-pointer-sign -Wno-stringop-truncation -Wno-zero-length-bounds -Wno-array-bounds -Wno-stringop-overflow -Wno-restrict -Wno-maybe-uninitialized -fno-strict-overflow -fno-stack-check -fconserve-stack -Werror=date-time -Werror=incompatible-pointer-types -Werror=designated-init -Wno-packed-not-aligned -Iinclude/drm  -DMODULE  -DKBUILD_BASENAME='"evdi_painter"' -DKBUILD_MODNAME='"evdi"' -c -o /var/lib/dkms/evdi/1.7.0/build/evdi_painter.o /var/lib/dkms/evdi/1.7.0/build/evdi_painter.c
   gcc-10 -Wp,-MMD,/var/lib/dkms/evdi/1.7.0/build/.evdi_params.o.d -nostdinc -isystem /usr/lib/gcc/x86_64-linux-gnu/10/include -I/usr/src/linux-headers-5.10.0-6-common/arch/x86/include -I./arch/x86/include/generated -I/usr/src/linux-headers-5.10.0-6-common/include -I./include -I/usr/src/linux-headers-5.10.0-6-common/arch/x86/include/uapi -I./arch/x86/include/generated/uapi -I/usr/src/linux-headers-5.10.0-6-common/include/uapi -I./include/generated/uapi -include /usr/src/linux-headers-5.10.0-6-common/include/linux/kconfig.h -include /usr/src/linux-headers-5.10.0-6-common/include/linux/compiler_types.h -D__KERNEL__ -fmacro-prefix-map=/usr/src/linux-headers-5.10.0-6-common/= -Wall -Wundef -Werror=strict-prototypes -Wno-trigraphs -fno-strict-aliasing -fno-common -fshort-wchar -fno-PIE -Werror=implicit-function-declaration -Werror=implicit-int -Werror=return-type -Wno-format-security -std=gnu89 -mno-sse -mno-mmx -mno-sse2 -mno-3dnow -mno-avx -fcf-protection=none -m64 -falign-jumps=1 -falign-loops=1 -mno-80387 -mno-fp-ret-in-387 -mpreferred-stack-boundary=3 -mskip-rax-setup -mtune=generic -mno-red-zone -mcmodel=kernel -DCONFIG_X86_X32_ABI -Wno-sign-compare -fno-asynchronous-unwind-tables -mindirect-branch=thunk-extern -mindirect-branch-register -fno-jump-tables -fno-delete-null-pointer-checks -Wno-frame-address -Wno-format-truncation -Wno-format-overflow -Wno-address-of-packed-member -O2 -fno-allow-store-data-races -Wframe-larger-than=2048 -fstack-protector-strong -Wno-unused-but-set-variable -Wimplicit-fallthrough -Wno-unused-const-variable -g -pg -mrecord-mcount -mfentry -DCC_USING_FENTRY -Wdeclaration-after-statement -Wvla -Wno-pointer-sign -Wno-stringop-truncation -Wno-zero-length-bounds -Wno-array-bounds -Wno-stringop-overflow -Wno-restrict -Wno-maybe-uninitialized -fno-strict-overflow -fno-stack-check -fconserve-stack -Werror=date-time -Werror=incompatible-pointer-types -Werror=designated-init -Wno-packed-not-aligned -Iinclude/drm  -DMODULE  -DKBUILD_BASENAME='"evdi_params"' -DKBUILD_MODNAME='"evdi"' -c -o /var/lib/dkms/evdi/1.7.0/build/evdi_params.o /var/lib/dkms/evdi/1.7.0/build/evdi_params.c
   gcc-10 -Wp,-MMD,/var/lib/dkms/evdi/1.7.0/build/.evdi_cursor.o.d -nostdinc -isystem /usr/lib/gcc/x86_64-linux-gnu/10/include -I/usr/src/linux-headers-5.10.0-6-common/arch/x86/include -I./arch/x86/include/generated -I/usr/src/linux-headers-5.10.0-6-common/include -I./include -I/usr/src/linux-headers-5.10.0-6-common/arch/x86/include/uapi -I./arch/x86/include/generated/uapi -I/usr/src/linux-headers-5.10.0-6-common/include/uapi -I./include/generated/uapi -include /usr/src/linux-headers-5.10.0-6-common/include/linux/kconfig.h -include /usr/src/linux-headers-5.10.0-6-common/include/linux/compiler_types.h -D__KERNEL__ -fmacro-prefix-map=/usr/src/linux-headers-5.10.0-6-common/= -Wall -Wundef -Werror=strict-prototypes -Wno-trigraphs -fno-strict-aliasing -fno-common -fshort-wchar -fno-PIE -Werror=implicit-function-declaration -Werror=implicit-int -Werror=return-type -Wno-format-security -std=gnu89 -mno-sse -mno-mmx -mno-sse2 -mno-3dnow -mno-avx -fcf-protection=none -m64 -falign-jumps=1 -falign-loops=1 -mno-80387 -mno-fp-ret-in-387 -mpreferred-stack-boundary=3 -mskip-rax-setup -mtune=generic -mno-red-zone -mcmodel=kernel -DCONFIG_X86_X32_ABI -Wno-sign-compare -fno-asynchronous-unwind-tables -mindirect-branch=thunk-extern -mindirect-branch-register -fno-jump-tables -fno-delete-null-pointer-checks -Wno-frame-address -Wno-format-truncation -Wno-format-overflow -Wno-address-of-packed-member -O2 -fno-allow-store-data-races -Wframe-larger-than=2048 -fstack-protector-strong -Wno-unused-but-set-variable -Wimplicit-fallthrough -Wno-unused-const-variable -g -pg -mrecord-mcount -mfentry -DCC_USING_FENTRY -Wdeclaration-after-statement -Wvla -Wno-pointer-sign -Wno-stringop-truncation -Wno-zero-length-bounds -Wno-array-bounds -Wno-stringop-overflow -Wno-restrict -Wno-maybe-uninitialized -fno-strict-overflow -fno-stack-check -fconserve-stack -Werror=date-time -Werror=incompatible-pointer-types -Werror=designated-init -Wno-packed-not-aligned -Iinclude/drm  -DMODULE  -DKBUILD_BASENAME='"evdi_cursor"' -DKBUILD_MODNAME='"evdi"' -c -o /var/lib/dkms/evdi/1.7.0/build/evdi_cursor.o /var/lib/dkms/evdi/1.7.0/build/evdi_cursor.c
   gcc-10 -Wp,-MMD,/var/lib/dkms/evdi/1.7.0/build/.evdi_debug.o.d -nostdinc -isystem /usr/lib/gcc/x86_64-linux-gnu/10/include -I/usr/src/linux-headers-5.10.0-6-common/arch/x86/include -I./arch/x86/include/generated -I/usr/src/linux-headers-5.10.0-6-common/include -I./include -I/usr/src/linux-headers-5.10.0-6-common/arch/x86/include/uapi -I./arch/x86/include/generated/uapi -I/usr/src/linux-headers-5.10.0-6-common/include/uapi -I./include/generated/uapi -include /usr/src/linux-headers-5.10.0-6-common/include/linux/kconfig.h -include /usr/src/linux-headers-5.10.0-6-common/include/linux/compiler_types.h -D__KERNEL__ -fmacro-prefix-map=/usr/src/linux-headers-5.10.0-6-common/= -Wall -Wundef -Werror=strict-prototypes -Wno-trigraphs -fno-strict-aliasing -fno-common -fshort-wchar -fno-PIE -Werror=implicit-function-declaration -Werror=implicit-int -Werror=return-type -Wno-format-security -std=gnu89 -mno-sse -mno-mmx -mno-sse2 -mno-3dnow -mno-avx -fcf-protection=none -m64 -falign-jumps=1 -falign-loops=1 -mno-80387 -mno-fp-ret-in-387 -mpreferred-stack-boundary=3 -mskip-rax-setup -mtune=generic -mno-red-zone -mcmodel=kernel -DCONFIG_X86_X32_ABI -Wno-sign-compare -fno-asynchronous-unwind-tables -mindirect-branch=thunk-extern -mindirect-branch-register -fno-jump-tables -fno-delete-null-pointer-checks -Wno-frame-address -Wno-format-truncation -Wno-format-overflow -Wno-address-of-packed-member -O2 -fno-allow-store-data-races -Wframe-larger-than=2048 -fstack-protector-strong -Wno-unused-but-set-variable -Wimplicit-fallthrough -Wno-unused-const-variable -g -pg -mrecord-mcount -mfentry -DCC_USING_FENTRY -Wdeclaration-after-statement -Wvla -Wno-pointer-sign -Wno-stringop-truncation -Wno-zero-length-bounds -Wno-array-bounds -Wno-stringop-overflow -Wno-restrict -Wno-maybe-uninitialized -fno-strict-overflow -fno-stack-check -fconserve-stack -Werror=date-time -Werror=incompatible-pointer-types -Werror=designated-init -Wno-packed-not-aligned -Iinclude/drm  -DMODULE  -DKBUILD_BASENAME='"evdi_debug"' -DKBUILD_MODNAME='"evdi"' -c -o /var/lib/dkms/evdi/1.7.0/build/evdi_debug.o /var/lib/dkms/evdi/1.7.0/build/evdi_debug.c
   gcc-10 -Wp,-MMD,/var/lib/dkms/evdi/1.7.0/build/.evdi_ioc32.o.d -nostdinc -isystem /usr/lib/gcc/x86_64-linux-gnu/10/include -I/usr/src/linux-headers-5.10.0-6-common/arch/x86/include -I./arch/x86/include/generated -I/usr/src/linux-headers-5.10.0-6-common/include -I./include -I/usr/src/linux-headers-5.10.0-6-common/arch/x86/include/uapi -I./arch/x86/include/generated/uapi -I/usr/src/linux-headers-5.10.0-6-common/include/uapi -I./include/generated/uapi -include /usr/src/linux-headers-5.10.0-6-common/include/linux/kconfig.h -include /usr/src/linux-headers-5.10.0-6-common/include/linux/compiler_types.h -D__KERNEL__ -fmacro-prefix-map=/usr/src/linux-headers-5.10.0-6-common/= -Wall -Wundef -Werror=strict-prototypes -Wno-trigraphs -fno-strict-aliasing -fno-common -fshort-wchar -fno-PIE -Werror=implicit-function-declaration -Werror=implicit-int -Werror=return-type -Wno-format-security -std=gnu89 -mno-sse -mno-mmx -mno-sse2 -mno-3dnow -mno-avx -fcf-protection=none -m64 -falign-jumps=1 -falign-loops=1 -mno-80387 -mno-fp-ret-in-387 -mpreferred-stack-boundary=3 -mskip-rax-setup -mtune=generic -mno-red-zone -mcmodel=kernel -DCONFIG_X86_X32_ABI -Wno-sign-compare -fno-asynchronous-unwind-tables -mindirect-branch=thunk-extern -mindirect-branch-register -fno-jump-tables -fno-delete-null-pointer-checks -Wno-frame-address -Wno-format-truncation -Wno-format-overflow -Wno-address-of-packed-member -O2 -fno-allow-store-data-races -Wframe-larger-than=2048 -fstack-protector-strong -Wno-unused-but-set-variable -Wimplicit-fallthrough -Wno-unused-const-variable -g -pg -mrecord-mcount -mfentry -DCC_USING_FENTRY -Wdeclaration-after-statement -Wvla -Wno-pointer-sign -Wno-stringop-truncation -Wno-zero-length-bounds -Wno-array-bounds -Wno-stringop-overflow -Wno-restrict -Wno-maybe-uninitialized -fno-strict-overflow -fno-stack-check -fconserve-stack -Werror=date-time -Werror=incompatible-pointer-types -Werror=designated-init -Wno-packed-not-aligned -Iinclude/drm  -DMODULE  -DKBUILD_BASENAME='"evdi_ioc32"' -DKBUILD_MODNAME='"evdi"' -c -o /var/lib/dkms/evdi/1.7.0/build/evdi_ioc32.o /var/lib/dkms/evdi/1.7.0/build/evdi_ioc32.c
   ./tools/objtool/objtool orc generate  --module --no-fp --retpoline --uaccess /var/lib/dkms/evdi/1.7.0/build/evdi_debug.o
  if objdump -h /var/lib/dkms/evdi/1.7.0/build/evdi_debug.o | grep -q __ksymtab; then  gcc-10 -E -D__GENKSYMS__ -Wp,-MMD,/var/lib/dkms/evdi/1.7.0/build/.evdi_debug.o.d -nostdinc -isystem /usr/lib/gcc/x86_64-linux-gnu/10/include -I/usr/src/linux-headers-5.10.0-6-common/arch/x86/include -I./arch/x86/include/generated -I/usr/src/linux-headers-5.10.0-6-common/include -I./include -I/usr/src/linux-headers-5.10.0-6-common/arch/x86/include/uapi -I./arch/x86/include/generated/uapi -I/usr/src/linux-headers-5.10.0-6-common/include/uapi -I./include/generated/uapi -include /usr/src/linux-headers-5.10.0-6-common/include/linux/kconfig.h -include /usr/src/linux-headers-5.10.0-6-common/include/linux/compiler_types.h -D__KERNEL__ -fmacro-prefix-map=/usr/src/linux-headers-5.10.0-6-common/= -Wall -Wundef -Werror=strict-prototypes -Wno-trigraphs -fno-strict-aliasing -fno-common -fshort-wchar -fno-PIE -Werror=implicit-function-declaration -Werror=implicit-int -Werror=return-type -Wno-format-security -std=gnu89 -mno-sse -mno-mmx -mno-sse2 -mno-3dnow -mno-avx -fcf-protection=none -m64 -falign-jumps=1 -falign-loops=1 -mno-80387 -mno-fp-ret-in-387 -mpreferred-stack-boundary=3 -mskip-rax-setup -mtune=generic -mno-red-zone -mcmodel=kernel -DCONFIG_X86_X32_ABI -Wno-sign-compare -fno-asynchronous-unwind-tables -mindirect-branch=thunk-extern -mindirect-branch-register -fno-jump-tables -fno-delete-null-pointer-checks -Wno-frame-address -Wno-format-truncation -Wno-format-overflow -Wno-address-of-packed-member -O2 -fno-allow-store-data-races -Wframe-larger-than=2048 -fstack-protector-strong -Wno-unused-but-set-variable -Wimplicit-fallthrough -Wno-unused-const-variable -g -pg -mrecord-mcount -mfentry -DCC_USING_FENTRY -Wdeclaration-after-statement -Wvla -Wno-pointer-sign -Wno-stringop-truncation -Wno-zero-length-bounds -Wno-array-bounds -Wno-stringop-overflow -Wno-restrict -Wno-maybe-uninitialized -fno-strict-overflow -fno-stack-check -fconserve-stack -Werror=date-time -Werror=incompatible-pointer-types -Werror=designated-init -Wno-packed-not-aligned -Iinclude/drm  -DMODULE  -DKBUILD_BASENAME='"evdi_debug"' -DKBUILD_MODNAME='"evdi"' /var/lib/dkms/evdi/1.7.0/build/evdi_debug.c | scripts/genksyms/genksyms    -r /dev/null > /var/lib/dkms/evdi/1.7.0/build/.tmp_evdi_debug.ver; ld -m elf_x86_64 -r -o /var/lib/dkms/evdi/1.7.0/build/.tmp_evdi_debug.o /var/lib/dkms/evdi/1.7.0/build/evdi_debug.o -T /var/lib/dkms/evdi/1.7.0/build/.tmp_evdi_debug.ver; mv -f /var/lib/dkms/evdi/1.7.0/build/.tmp_evdi_debug.o /var/lib/dkms/evdi/1.7.0/build/evdi_debug.o; rm -f /var/lib/dkms/evdi/1.7.0/build/.tmp_evdi_debug.ver; fi
   ./tools/objtool/objtool orc generate  --module --no-fp --retpoline --uaccess /var/lib/dkms/evdi/1.7.0/build/evdi_params.o
  if objdump -h /var/lib/dkms/evdi/1.7.0/build/evdi_params.o | grep -q __ksymtab; then  gcc-10 -E -D__GENKSYMS__ -Wp,-MMD,/var/lib/dkms/evdi/1.7.0/build/.evdi_params.o.d -nostdinc -isystem /usr/lib/gcc/x86_64-linux-gnu/10/include -I/usr/src/linux-headers-5.10.0-6-common/arch/x86/include -I./arch/x86/include/generated -I/usr/src/linux-headers-5.10.0-6-common/include -I./include -I/usr/src/linux-headers-5.10.0-6-common/arch/x86/include/uapi -I./arch/x86/include/generated/uapi -I/usr/src/linux-headers-5.10.0-6-common/include/uapi -I./include/generated/uapi -include /usr/src/linux-headers-5.10.0-6-common/include/linux/kconfig.h -include /usr/src/linux-headers-5.10.0-6-common/include/linux/compiler_types.h -D__KERNEL__ -fmacro-prefix-map=/usr/src/linux-headers-5.10.0-6-common/= -Wall -Wundef -Werror=strict-prototypes -Wno-trigraphs -fno-strict-aliasing -fno-common -fshort-wchar -fno-PIE -Werror=implicit-function-declaration -Werror=implicit-int -Werror=return-type -Wno-format-security -std=gnu89 -mno-sse -mno-mmx -mno-sse2 -mno-3dnow -mno-avx -fcf-protection=none -m64 -falign-jumps=1 -falign-loops=1 -mno-80387 -mno-fp-ret-in-387 -mpreferred-stack-boundary=3 -mskip-rax-setup -mtune=generic -mno-red-zone -mcmodel=kernel -DCONFIG_X86_X32_ABI -Wno-sign-compare -fno-asynchronous-unwind-tables -mindirect-branch=thunk-extern -mindirect-branch-register -fno-jump-tables -fno-delete-null-pointer-checks -Wno-frame-address -Wno-format-truncation -Wno-format-overflow -Wno-address-of-packed-member -O2 -fno-allow-store-data-races -Wframe-larger-than=2048 -fstack-protector-strong -Wno-unused-but-set-variable -Wimplicit-fallthrough -Wno-unused-const-variable -g -pg -mrecord-mcount -mfentry -DCC_USING_FENTRY -Wdeclaration-after-statement -Wvla -Wno-pointer-sign -Wno-stringop-truncation -Wno-zero-length-bounds -Wno-array-bounds -Wno-stringop-overflow -Wno-restrict -Wno-maybe-uninitialized -fno-strict-overflow -fno-stack-check -fconserve-stack -Werror=date-time -Werror=incompatible-pointer-types -Werror=designated-init -Wno-packed-not-aligned -Iinclude/drm  -DMODULE  -DKBUILD_BASENAME='"evdi_params"' -DKBUILD_MODNAME='"evdi"' /var/lib/dkms/evdi/1.7.0/build/evdi_params.c | scripts/genksyms/genksyms    -r /dev/null > /var/lib/dkms/evdi/1.7.0/build/.tmp_evdi_params.ver; ld -m elf_x86_64 -r -o /var/lib/dkms/evdi/1.7.0/build/.tmp_evdi_params.o /var/lib/dkms/evdi/1.7.0/build/evdi_params.o -T /var/lib/dkms/evdi/1.7.0/build/.tmp_evdi_params.ver; mv -f /var/lib/dkms/evdi/1.7.0/build/.tmp_evdi_params.o /var/lib/dkms/evdi/1.7.0/build/evdi_params.o; rm -f /var/lib/dkms/evdi/1.7.0/build/.tmp_evdi_params.ver; fi
/var/lib/dkms/evdi/1.7.0/build/evdi_drv.c:92:3: error: ‘struct drm_driver’ has no member named ‘gem_free_object’; did you mean ‘gem_open_object’?
   92 |  .gem_free_object = evdi_gem_free_object,
      |   ^~~~~~~~~~~~~~~
      |   gem_open_object
/var/lib/dkms/evdi/1.7.0/build/evdi_drv.c:92:21: error: initialization of ‘void (*)(struct drm_device *)’ from incompatible pointer type ‘void (*)(struct drm_gem_object *)’ [-Werror=incompatible-pointer-types]
   92 |  .gem_free_object = evdi_gem_free_object,
      |                     ^~~~~~~~~~~~~~~~~~~~
/var/lib/dkms/evdi/1.7.0/build/evdi_drv.c:92:21: note: (near initialization for ‘driver.lastclose’)
/var/lib/dkms/evdi/1.7.0/build/evdi_drv.c: In function ‘evdi_platform_probe’:
/var/lib/dkms/evdi/1.7.0/build/evdi_drv.c:173:20: error: ‘struct dev_archdata’ has no member named ‘iommu’
  173 |  pdev->dev.archdata.iommu = INTEL_IOMMU_DUMMY_DOMAIN;
      |                    ^
cc1: some warnings being treated as errors
make[3]: *** [/usr/src/linux-headers-5.10.0-6-common/scripts/Makefile.build:284 : /var/lib/dkms/evdi/1.7.0/build/evdi_drv.o] Erreur 1
make[3]: *** Attente des tâches non terminées....
/var/lib/dkms/evdi/1.7.0/build/evdi_cursor.c: In function ‘evdi_cursor_set_gem’:
/var/lib/dkms/evdi/1.7.0/build/evdi_cursor.c:58:3: error: implicit declaration of function ‘drm_gem_object_put_unlocked’; did you mean ‘drm_gem_object_put_locked’? [-Werror=implicit-function-declaration]
   58 |   drm_gem_object_put_unlocked(&cursor->obj->base);
      |   ^~~~~~~~~~~~~~~~~~~~~~~~~~~
      |   drm_gem_object_put_locked
/var/lib/dkms/evdi/1.7.0/build/evdi_modeset.c: In function ‘evdi_crtc_cursor_set’:
   ./tools/objtool/objtool orc generate  --module --no-fp --retpoline --uaccess /var/lib/dkms/evdi/1.7.0/build/evdi_ioc32.o
/var/lib/dkms/evdi/1.7.0/build/evdi_modeset.c:133:2: error: implicit declaration of function ‘drm_gem_object_put_unlocked’; did you mean ‘drm_gem_object_put_locked’? [-Werror=implicit-function-declaration]
  133 |  drm_gem_object_put_unlocked(obj);
      |  ^~~~~~~~~~~~~~~~~~~~~~~~~~~
      |  drm_gem_object_put_locked
/var/lib/dkms/evdi/1.7.0/build/evdi_fb.c: In function ‘evdi_user_framebuffer_destroy’:
/var/lib/dkms/evdi/1.7.0/build/evdi_fb.c:322:3: error: implicit declaration of function ‘drm_gem_object_put_unlocked’; did you mean ‘drm_gem_object_put_locked’? [-Werror=implicit-function-declaration]
  322 |   drm_gem_object_put_unlocked(&efb->obj->base);
      |   ^~~~~~~~~~~~~~~~~~~~~~~~~~~
      |   drm_gem_object_put_locked
   ./tools/objtool/objtool orc generate  --module --no-fp --retpoline --uaccess /var/lib/dkms/evdi/1.7.0/build/evdi_encoder.o
/var/lib/dkms/evdi/1.7.0/build/evdi_gem.c: In function ‘evdi_gem_create’:
/var/lib/dkms/evdi/1.7.0/build/evdi_gem.c:85:2: error: implicit declaration of function ‘drm_gem_object_put_unlocked’; did you mean ‘drm_gem_object_put_locked’? [-Werror=implicit-function-declaration]
   85 |  drm_gem_object_put_unlocked(&obj->base);
      |  ^~~~~~~~~~~~~~~~~~~~~~~~~~~
      |  drm_gem_object_put_locked
/var/lib/dkms/evdi/1.7.0/build/evdi_gem.c: In function ‘evdi_prime_get_sg_table’:
/var/lib/dkms/evdi/1.7.0/build/evdi_gem.c:306:33: error: passing argument 1 of ‘drm_prime_pages_to_sg’ from incompatible pointer type [-Werror=incompatible-pointer-types]
  306 |  return drm_prime_pages_to_sg(bo->pages, bo->base.size >> PAGE_SHIFT);
      |                               ~~^~~~~~~
      |                                 |
      |                                 struct page **
In file included from /usr/src/linux-headers-5.10.0-6-common/include/drm/drm_file.h:39,
                 from /usr/src/linux-headers-5.10.0-6-common/include/drm/drm_vblank.h:32,
                 from /var/lib/dkms/evdi/1.7.0/build/evdi_drv.h:25,
                 from /var/lib/dkms/evdi/1.7.0/build/evdi_gem.c:16:
/usr/src/linux-headers-5.10.0-6-common/include/drm/drm_prime.h:91:59: note: expected ‘struct drm_device *’ but argument is of type ‘struct page **’
   91 | struct sg_table *drm_prime_pages_to_sg(struct drm_device *dev,
      |                                        ~~~~~~~~~~~~~~~~~~~^~~
/var/lib/dkms/evdi/1.7.0/build/evdi_gem.c:306:56: warning: passing argument 2 of ‘drm_prime_pages_to_sg’ makes pointer from integer without a cast [-Wint-conversion]
  306 |  return drm_prime_pages_to_sg(bo->pages, bo->base.size >> PAGE_SHIFT);
In file included from /usr/src/linux-headers-5.10.0-6-common/include/drm/drm_file.h:39,
                 from /usr/src/linux-headers-5.10.0-6-common/include/drm/drm_vblank.h:32,
                 from /var/lib/dkms/evdi/1.7.0/build/evdi_drv.h:25,
                 from /var/lib/dkms/evdi/1.7.0/build/evdi_gem.c:16:
/usr/src/linux-headers-5.10.0-6-common/include/drm/drm_prime.h:92:26: note: expected ‘struct page **’ but argument is of type ‘size_t’ {aka ‘long unsigned int’}
   92 |            struct page **pages, unsigned int nr_pages);
      |            ~~~~~~~~~~~~~~^~~~~
/var/lib/dkms/evdi/1.7.0/build/evdi_gem.c:306:9: error: too few arguments to function ‘drm_prime_pages_to_sg’
  306 |  return drm_prime_pages_to_sg(bo->pages, bo->base.size >> PAGE_SHIFT);
      |         ^~~~~~~~~~~~~~~~~~~~~
In file included from /usr/src/linux-headers-5.10.0-6-common/include/drm/drm_file.h:39,
                 from /usr/src/linux-headers-5.10.0-6-common/include/drm/drm_vblank.h:32,
                 from /var/lib/dkms/evdi/1.7.0/build/evdi_drv.h:25,
                 from /var/lib/dkms/evdi/1.7.0/build/evdi_gem.c:16:
/usr/src/linux-headers-5.10.0-6-common/include/drm/drm_prime.h:91:18: note: declared here
   91 | struct sg_table *drm_prime_pages_to_sg(struct drm_device *dev,
      |                  ^~~~~~~~~~~~~~~~~~~~~
  if objdump -h /var/lib/dkms/evdi/1.7.0/build/evdi_ioc32.o | grep -q __ksymtab; then  gcc-10 -E -D__GENKSYMS__ -Wp,-MMD,/var/lib/dkms/evdi/1.7.0/build/.evdi_ioc32.o.d -nostdinc -isystem /usr/lib/gcc/x86_64-linux-gnu/10/include -I/usr/src/linux-headers-5.10.0-6-common/arch/x86/include -I./arch/x86/include/generated -I/usr/src/linux-headers-5.10.0-6-common/include -I./include -I/usr/src/linux-headers-5.10.0-6-common/arch/x86/include/uapi -I./arch/x86/include/generated/uapi -I/usr/src/linux-headers-5.10.0-6-common/include/uapi -I./include/generated/uapi -include /usr/src/linux-headers-5.10.0-6-common/include/linux/kconfig.h -include /usr/src/linux-headers-5.10.0-6-common/include/linux/compiler_types.h -D__KERNEL__ -fmacro-prefix-map=/usr/src/linux-headers-5.10.0-6-common/= -Wall -Wundef -Werror=strict-prototypes -Wno-trigraphs -fno-strict-aliasing -fno-common -fshort-wchar -fno-PIE -Werror=implicit-function-declaration -Werror=implicit-int -Werror=return-type -Wno-format-security -std=gnu89 -mno-sse -mno-mmx -mno-sse2 -mno-3dnow -mno-avx -fcf-protection=none -m64 -falign-jumps=1 -falign-loops=1 -mno-80387 -mno-fp-ret-in-387 -mpreferred-stack-boundary=3 -mskip-rax-setup -mtune=generic -mno-red-zone -mcmodel=kernel -DCONFIG_X86_X32_ABI -Wno-sign-compare -fno-asynchronous-unwind-tables -mindirect-branch=thunk-extern -mindirect-branch-register -fno-jump-tables -fno-delete-null-pointer-checks -Wno-frame-address -Wno-format-truncation -Wno-format-overflow -Wno-address-of-packed-member -O2 -fno-allow-store-data-races -Wframe-larger-than=2048 -fstack-protector-strong -Wno-unused-but-set-variable -Wimplicit-fallthrough -Wno-unused-const-variable -g -pg -mrecord-mcount -mfentry -DCC_USING_FENTRY -Wdeclaration-after-statement -Wvla -Wno-pointer-sign -Wno-stringop-truncation -Wno-zero-length-bounds -Wno-array-bounds -Wno-stringop-overflow -Wno-restrict -Wno-maybe-uninitialized -fno-strict-overflow -fno-stack-check -fconserve-stack -Werror=date-time -Werror=incompatible-pointer-types -Werror=designated-init -Wno-packed-not-aligned -Iinclude/drm  -DMODULE  -DKBUILD_BASENAME='"evdi_ioc32"' -DKBUILD_MODNAME='"evdi"' /var/lib/dkms/evdi/1.7.0/build/evdi_ioc32.c | scripts/genksyms/genksyms    -r /dev/null > /var/lib/dkms/evdi/1.7.0/build/.tmp_evdi_ioc32.ver; ld -m elf_x86_64 -r -o /var/lib/dkms/evdi/1.7.0/build/.tmp_evdi_ioc32.o /var/lib/dkms/evdi/1.7.0/build/evdi_ioc32.o -T /var/lib/dkms/evdi/1.7.0/build/.tmp_evdi_ioc32.ver; mv -f /var/lib/dkms/evdi/1.7.0/build/.tmp_evdi_ioc32.o /var/lib/dkms/evdi/1.7.0/build/evdi_ioc32.o; rm -f /var/lib/dkms/evdi/1.7.0/build/.tmp_evdi_ioc32.ver; fi
   ./tools/objtool/objtool orc generate  --module --no-fp --retpoline --uaccess /var/lib/dkms/evdi/1.7.0/build/evdi_main.o
  if objdump -h /var/lib/dkms/evdi/1.7.0/build/evdi_encoder.o | grep -q __ksymtab; then  gcc-10 -E -D__GENKSYMS__ -Wp,-MMD,/var/lib/dkms/evdi/1.7.0/build/.evdi_encoder.o.d -nostdinc -isystem /usr/lib/gcc/x86_64-linux-gnu/10/include -I/usr/src/linux-headers-5.10.0-6-common/arch/x86/include -I./arch/x86/include/generated -I/usr/src/linux-headers-5.10.0-6-common/include -I./include -I/usr/src/linux-headers-5.10.0-6-common/arch/x86/include/uapi -I./arch/x86/include/generated/uapi -I/usr/src/linux-headers-5.10.0-6-common/include/uapi -I./include/generated/uapi -include /usr/src/linux-headers-5.10.0-6-common/include/linux/kconfig.h -include /usr/src/linux-headers-5.10.0-6-common/include/linux/compiler_types.h -D__KERNEL__ -fmacro-prefix-map=/usr/src/linux-headers-5.10.0-6-common/= -Wall -Wundef -Werror=strict-prototypes -Wno-trigraphs -fno-strict-aliasing -fno-common -fshort-wchar -fno-PIE -Werror=implicit-function-declaration -Werror=implicit-int -Werror=return-type -Wno-format-security -std=gnu89 -mno-sse -mno-mmx -mno-sse2 -mno-3dnow -mno-avx -fcf-protection=none -m64 -falign-jumps=1 -falign-loops=1 -mno-80387 -mno-fp-ret-in-387 -mpreferred-stack-boundary=3 -mskip-rax-setup -mtune=generic -mno-red-zone -mcmodel=kernel -DCONFIG_X86_X32_ABI -Wno-sign-compare -fno-asynchronous-unwind-tables -mindirect-branch=thunk-extern -mindirect-branch-register -fno-jump-tables -fno-delete-null-pointer-checks -Wno-frame-address -Wno-format-truncation -Wno-format-overflow -Wno-address-of-packed-member -O2 -fno-allow-store-data-races -Wframe-larger-than=2048 -fstack-protector-strong -Wno-unused-but-set-variable -Wimplicit-fallthrough -Wno-unused-const-variable -g -pg -mrecord-mcount -mfentry -DCC_USING_FENTRY -Wdeclaration-after-statement -Wvla -Wno-pointer-sign -Wno-stringop-truncation -Wno-zero-length-bounds -Wno-array-bounds -Wno-stringop-overflow -Wno-restrict -Wno-maybe-uninitialized -fno-strict-overflow -fno-stack-check -fconserve-stack -Werror=date-time -Werror=incompatible-pointer-types -Werror=designated-init -Wno-packed-not-aligned -Iinclude/drm  -DMODULE  -DKBUILD_BASENAME='"evdi_encoder"' -DKBUILD_MODNAME='"evdi"' /var/lib/dkms/evdi/1.7.0/build/evdi_encoder.c | scripts/genksyms/genksyms    -r /dev/null > /var/lib/dkms/evdi/1.7.0/build/.tmp_evdi_encoder.ver; ld -m elf_x86_64 -r -o /var/lib/dkms/evdi/1.7.0/build/.tmp_evdi_encoder.o /var/lib/dkms/evdi/1.7.0/build/evdi_encoder.o -T /var/lib/dkms/evdi/1.7.0/build/.tmp_evdi_encoder.ver; mv -f /var/lib/dkms/evdi/1.7.0/build/.tmp_evdi_encoder.o /var/lib/dkms/evdi/1.7.0/build/evdi_encoder.o; rm -f /var/lib/dkms/evdi/1.7.0/build/.tmp_evdi_encoder.ver; fi
/var/lib/dkms/evdi/1.7.0/build/evdi_gem.c:307:1: error: control reaches end of non-void function [-Werror=return-type]
  307 | }
      | ^
cc1: some warnings being treated as errors
  if objdump -h /var/lib/dkms/evdi/1.7.0/build/evdi_main.o | grep -q __ksymtab; then  gcc-10 -E -D__GENKSYMS__ -Wp,-MMD,/var/lib/dkms/evdi/1.7.0/build/.evdi_main.o.d -nostdinc -isystem /usr/lib/gcc/x86_64-linux-gnu/10/include -I/usr/src/linux-headers-5.10.0-6-common/arch/x86/include -I./arch/x86/include/generated -I/usr/src/linux-headers-5.10.0-6-common/include -I./include -I/usr/src/linux-headers-5.10.0-6-common/arch/x86/include/uapi -I./arch/x86/include/generated/uapi -I/usr/src/linux-headers-5.10.0-6-common/include/uapi -I./include/generated/uapi -include /usr/src/linux-headers-5.10.0-6-common/include/linux/kconfig.h -include /usr/src/linux-headers-5.10.0-6-common/include/linux/compiler_types.h -D__KERNEL__ -fmacro-prefix-map=/usr/src/linux-headers-5.10.0-6-common/= -Wall -Wundef -Werror=strict-prototypes -Wno-trigraphs -fno-strict-aliasing -fno-common -fshort-wchar -fno-PIE -Werror=implicit-function-declaration -Werror=implicit-int -Werror=return-type -Wno-format-security -std=gnu89 -mno-sse -mno-mmx -mno-sse2 -mno-3dnow -mno-avx -fcf-protection=none -m64 -falign-jumps=1 -falign-loops=1 -mno-80387 -mno-fp-ret-in-387 -mpreferred-stack-boundary=3 -mskip-rax-setup -mtune=generic -mno-red-zone -mcmodel=kernel -DCONFIG_X86_X32_ABI -Wno-sign-compare -fno-asynchronous-unwind-tables -mindirect-branch=thunk-extern -mindirect-branch-register -fno-jump-tables -fno-delete-null-pointer-checks -Wno-frame-address -Wno-format-truncation -Wno-format-overflow -Wno-address-of-packed-member -O2 -fno-allow-store-data-races -Wframe-larger-than=2048 -fstack-protector-strong -Wno-unused-but-set-variable -Wimplicit-fallthrough -Wno-unused-const-variable -g -pg -mrecord-mcount -mfentry -DCC_USING_FENTRY -Wdeclaration-after-statement -Wvla -Wno-pointer-sign -Wno-stringop-truncation -Wno-zero-length-bounds -Wno-array-bounds -Wno-stringop-overflow -Wno-restrict -Wno-maybe-uninitialized -fno-strict-overflow -fno-stack-check -fconserve-stack -Werror=date-time -Werror=incompatible-pointer-types -Werror=designated-init -Wno-packed-not-aligned -Iinclude/drm  -DMODULE  -DKBUILD_BASENAME='"evdi_main"' -DKBUILD_MODNAME='"evdi"' /var/lib/dkms/evdi/1.7.0/build/evdi_main.c | scripts/genksyms/genksyms    -r /dev/null > /var/lib/dkms/evdi/1.7.0/build/.tmp_evdi_main.ver; ld -m elf_x86_64 -r -o /var/lib/dkms/evdi/1.7.0/build/.tmp_evdi_main.o /var/lib/dkms/evdi/1.7.0/build/evdi_main.o -T /var/lib/dkms/evdi/1.7.0/build/.tmp_evdi_main.ver; mv -f /var/lib/dkms/evdi/1.7.0/build/.tmp_evdi_main.o /var/lib/dkms/evdi/1.7.0/build/evdi_main.o; rm -f /var/lib/dkms/evdi/1.7.0/build/.tmp_evdi_main.ver; fi
make[3]: *** [/usr/src/linux-headers-5.10.0-6-common/scripts/Makefile.build:284 : /var/lib/dkms/evdi/1.7.0/build/evdi_gem.o] Erreur 1
cc1: some warnings being treated as errors
make[3]: *** [/usr/src/linux-headers-5.10.0-6-common/scripts/Makefile.build:284 : /var/lib/dkms/evdi/1.7.0/build/evdi_cursor.o] Erreur 1
   ./tools/objtool/objtool orc generate  --module --no-fp --retpoline --uaccess /var/lib/dkms/evdi/1.7.0/build/evdi_connector.o
  if objdump -h /var/lib/dkms/evdi/1.7.0/build/evdi_connector.o | grep -q __ksymtab; then  gcc-10 -E -D__GENKSYMS__ -Wp,-MMD,/var/lib/dkms/evdi/1.7.0/build/.evdi_connector.o.d -nostdinc -isystem /usr/lib/gcc/x86_64-linux-gnu/10/include -I/usr/src/linux-headers-5.10.0-6-common/arch/x86/include -I./arch/x86/include/generated -I/usr/src/linux-headers-5.10.0-6-common/include -I./include -I/usr/src/linux-headers-5.10.0-6-common/arch/x86/include/uapi -I./arch/x86/include/generated/uapi -I/usr/src/linux-headers-5.10.0-6-common/include/uapi -I./include/generated/uapi -include /usr/src/linux-headers-5.10.0-6-common/include/linux/kconfig.h -include /usr/src/linux-headers-5.10.0-6-common/include/linux/compiler_types.h -D__KERNEL__ -fmacro-prefix-map=/usr/src/linux-headers-5.10.0-6-common/= -Wall -Wundef -Werror=strict-prototypes -Wno-trigraphs -fno-strict-aliasing -fno-common -fshort-wchar -fno-PIE -Werror=implicit-function-declaration -Werror=implicit-int -Werror=return-type -Wno-format-security -std=gnu89 -mno-sse -mno-mmx -mno-sse2 -mno-3dnow -mno-avx -fcf-protection=none -m64 -falign-jumps=1 -falign-loops=1 -mno-80387 -mno-fp-ret-in-387 -mpreferred-stack-boundary=3 -mskip-rax-setup -mtune=generic -mno-red-zone -mcmodel=kernel -DCONFIG_X86_X32_ABI -Wno-sign-compare -fno-asynchronous-unwind-tables -mindirect-branch=thunk-extern -mindirect-branch-register -fno-jump-tables -fno-delete-null-pointer-checks -Wno-frame-address -Wno-format-truncation -Wno-format-overflow -Wno-address-of-packed-member -O2 -fno-allow-store-data-races -Wframe-larger-than=2048 -fstack-protector-strong -Wno-unused-but-set-variable -Wimplicit-fallthrough -Wno-unused-const-variable -g -pg -mrecord-mcount -mfentry -DCC_USING_FENTRY -Wdeclaration-after-statement -Wvla -Wno-pointer-sign -Wno-stringop-truncation -Wno-zero-length-bounds -Wno-array-bounds -Wno-stringop-overflow -Wno-restrict -Wno-maybe-uninitialized -fno-strict-overflow -fno-stack-check -fconserve-stack -Werror=date-time -Werror=incompatible-pointer-types -Werror=designated-init -Wno-packed-not-aligned -Iinclude/drm  -DMODULE  -DKBUILD_BASENAME='"evdi_connector"' -DKBUILD_MODNAME='"evdi"' /var/lib/dkms/evdi/1.7.0/build/evdi_connector.c | scripts/genksyms/genksyms    -r /dev/null > /var/lib/dkms/evdi/1.7.0/build/.tmp_evdi_connector.ver; ld -m elf_x86_64 -r -o /var/lib/dkms/evdi/1.7.0/build/.tmp_evdi_connector.o /var/lib/dkms/evdi/1.7.0/build/evdi_connector.o -T /var/lib/dkms/evdi/1.7.0/build/.tmp_evdi_connector.ver; mv -f /var/lib/dkms/evdi/1.7.0/build/.tmp_evdi_connector.o /var/lib/dkms/evdi/1.7.0/build/evdi_connector.o; rm -f /var/lib/dkms/evdi/1.7.0/build/.tmp_evdi_connector.ver; fi
cc1: some warnings being treated as errors
make[3]: *** [/usr/src/linux-headers-5.10.0-6-common/scripts/Makefile.build:284 : /var/lib/dkms/evdi/1.7.0/build/evdi_modeset.o] Erreur 1
cc1: some warnings being treated as errors
make[3]: *** [/usr/src/linux-headers-5.10.0-6-common/scripts/Makefile.build:284 : /var/lib/dkms/evdi/1.7.0/build/evdi_fb.o] Erreur 1
   ./tools/objtool/objtool orc generate  --module --no-fp --retpoline --uaccess /var/lib/dkms/evdi/1.7.0/build/evdi_painter.o
  if objdump -h /var/lib/dkms/evdi/1.7.0/build/evdi_painter.o | grep -q __ksymtab; then  gcc-10 -E -D__GENKSYMS__ -Wp,-MMD,/var/lib/dkms/evdi/1.7.0/build/.evdi_painter.o.d -nostdinc -isystem /usr/lib/gcc/x86_64-linux-gnu/10/include -I/usr/src/linux-headers-5.10.0-6-common/arch/x86/include -I./arch/x86/include/generated -I/usr/src/linux-headers-5.10.0-6-common/include -I./include -I/usr/src/linux-headers-5.10.0-6-common/arch/x86/include/uapi -I./arch/x86/include/generated/uapi -I/usr/src/linux-headers-5.10.0-6-common/include/uapi -I./include/generated/uapi -include /usr/src/linux-headers-5.10.0-6-common/include/linux/kconfig.h -include /usr/src/linux-headers-5.10.0-6-common/include/linux/compiler_types.h -D__KERNEL__ -fmacro-prefix-map=/usr/src/linux-headers-5.10.0-6-common/= -Wall -Wundef -Werror=strict-prototypes -Wno-trigraphs -fno-strict-aliasing -fno-common -fshort-wchar -fno-PIE -Werror=implicit-function-declaration -Werror=implicit-int -Werror=return-type -Wno-format-security -std=gnu89 -mno-sse -mno-mmx -mno-sse2 -mno-3dnow -mno-avx -fcf-protection=none -m64 -falign-jumps=1 -falign-loops=1 -mno-80387 -mno-fp-ret-in-387 -mpreferred-stack-boundary=3 -mskip-rax-setup -mtune=generic -mno-red-zone -mcmodel=kernel -DCONFIG_X86_X32_ABI -Wno-sign-compare -fno-asynchronous-unwind-tables -mindirect-branch=thunk-extern -mindirect-branch-register -fno-jump-tables -fno-delete-null-pointer-checks -Wno-frame-address -Wno-format-truncation -Wno-format-overflow -Wno-address-of-packed-member -O2 -fno-allow-store-data-races -Wframe-larger-than=2048 -fstack-protector-strong -Wno-unused-but-set-variable -Wimplicit-fallthrough -Wno-unused-const-variable -g -pg -mrecord-mcount -mfentry -DCC_USING_FENTRY -Wdeclaration-after-statement -Wvla -Wno-pointer-sign -Wno-stringop-truncation -Wno-zero-length-bounds -Wno-array-bounds -Wno-stringop-overflow -Wno-restrict -Wno-maybe-uninitialized -fno-strict-overflow -fno-stack-check -fconserve-stack -Werror=date-time -Werror=incompatible-pointer-types -Werror=designated-init -Wno-packed-not-aligned -Iinclude/drm  -DMODULE  -DKBUILD_BASENAME='"evdi_painter"' -DKBUILD_MODNAME='"evdi"' /var/lib/dkms/evdi/1.7.0/build/evdi_painter.c | scripts/genksyms/genksyms    -r /dev/null > /var/lib/dkms/evdi/1.7.0/build/.tmp_evdi_painter.ver; ld -m elf_x86_64 -r -o /var/lib/dkms/evdi/1.7.0/build/.tmp_evdi_painter.o /var/lib/dkms/evdi/1.7.0/build/evdi_painter.o -T /var/lib/dkms/evdi/1.7.0/build/.tmp_evdi_painter.ver; mv -f /var/lib/dkms/evdi/1.7.0/build/.tmp_evdi_painter.o /var/lib/dkms/evdi/1.7.0/build/evdi_painter.o; rm -f /var/lib/dkms/evdi/1.7.0/build/.tmp_evdi_painter.ver; fi
make[2]: *** [/usr/src/linux-headers-5.10.0-6-common/Makefile:1822 : /var/lib/dkms/evdi/1.7.0/build] Erreur 2
make[1]: *** [/usr/src/linux-headers-5.10.0-6-common/Makefile:185: __sub-make] Error 2
make[1]: Leaving directory '/usr/src/linux-headers-5.10.0-6-amd64'
make: *** [Makefile:22: all] Error 2



et là j'ai besoin d'aide...sos.gif

Dernière modification par 82(_)|\|0 (21-05-2021 06:39:37)


Jusqu'aux lèvres, la parole appartient à celui qui la donne,    ... ensuite elle appartient aussi à celui qui l'écoute
Lenovo ThinkPad P14s 8-Core AMD Ryzen 7 PRO 4750U with Radeon Graphics
OS1 : Debian bullseye/sid - 5.10.0-6-amd64 SMP Debian 5.10.28-1 (2021-04-09)
OS2 : Kubuntu 20.10 OS3 : openSUSE-Leap

Hors ligne

#2 07-05-2021 14:54:00

robert2a
Membre
Distrib. : debian 11
(G)UI : Mate
Inscription : 15-11-2014

Re : [Non-Résolu] Installer le Dock I-Tec USB 3.0 sur ThinkPad P14S

Bonjour
pour de l'aide pas le niveau
mais le message est clair


Error! Bad return status for module build on kernel: 5.10.0-6-amd64 (x86_64)
 


le noyau de debian11 ne supporte pas l'installation
mais aucune idée de comment résoudre ce souci
ps: si tu a la possibilité de faire un double boot debian/ubuntu tester sur ubuntu si l'installation est correcte.
ton lien donne sur un truc propriétaire , donc je ne suis pas aller plus loin
debian ne propose rien pour ce matériel ?  (en nonfree)

ps: on voit le dock avec lsusb ? ( brancher/débrancher )


lsusb
 

Dernière modification par robert2a (07-05-2021 14:56:18)

Hors ligne

#3 08-05-2021 08:58:56

82(_)|\|0
Adhérent(e)
Lieu : 36300 LE BLANC
Distrib. : Linux 5.10.0-6-amd64 bullseye/sid
Noyau : #1 SMP Debian 5.10.28-1 (2021-04-09)
(G)UI : SDDM - Kwin - KDE - Plasma
Inscription : 24-04-2021

Re : [Non-Résolu] Installer le Dock I-Tec USB 3.0 sur ThinkPad P14S

robert2a a écrit :

on voit le dock avec lsusb ? ( brancher/débrancher )

 lsusb


Voici ce qui est détecté une fois branché :

 lsusb


donne :

[...]
Bus 007 Device 015: ID 2109:0817 VIA Labs, Inc. USB3.0 Hub
[...]
Bus 006 Device 011: ID 059f:10c5 LaCie, Ltd Mobile Drive
Bus 006 Device 010: ID 0461:4e04 Primax Electronics, Ltd Lenovo Keyboard KB1021
Bus 006 Device 012: ID 1ea7:0064 SHARKOON Technologies GmbH 2.4GHz Wireless rechargeable vertical mouse [More&Better]
Bus 006 Device 009: ID 1a40:0101 Terminus Technology Inc. Hub
Bus 006 Device 008: ID 2109:2817 VIA Labs, Inc. USB2.0 Hub  
[...]



Le Dock fonctionne pour les ports USB, la prise casque et la prise micro mais pas pour les ports HDMI

Les ports HDMI ont fonctionné en janvier sous Kubuntu 20.10 mais ils ont été perdus avec des mises à jour et je n'avais pas noté les noyaux...


Jusqu'aux lèvres, la parole appartient à celui qui la donne,    ... ensuite elle appartient aussi à celui qui l'écoute
Lenovo ThinkPad P14s 8-Core AMD Ryzen 7 PRO 4750U with Radeon Graphics
OS1 : Debian bullseye/sid - 5.10.0-6-amd64 SMP Debian 5.10.28-1 (2021-04-09)
OS2 : Kubuntu 20.10 OS3 : openSUSE-Leap

Hors ligne

#4 09-05-2021 14:12:10

robert2a
Membre
Distrib. : debian 11
(G)UI : Mate
Inscription : 15-11-2014

Re : [Non-Résolu] Installer le Dock I-Tec USB 3.0 sur ThinkPad P14S

Bonjour
en janvier il me semble un noyau 5.10 déjà
tu peu donner le retour de lspci et de xrandr
tu a quel type de bureau , avec le serveur X  ou Wayland ? (sortie de mate je connais pas bien les bureaux . )
j'ai trouvé un fil avec le noyau 5.4 mais pas le même type de portable qui fonctionnait avec le dock
le dock utilisé


xrandr
 



lspci
 


ceci peut être  => https://blog.flozz.fr/2019/08/18/statio … us-ubuntu/
ps: un noyau compatible + driver propriétaire + ubuntu

nota: le dock est en USB3 ou ou USB type C (Thunderbolt 3)

Dernière modification par robert2a (09-05-2021 14:16:58)

Hors ligne

#5 09-05-2021 21:02:40

82(_)|\|0
Adhérent(e)
Lieu : 36300 LE BLANC
Distrib. : Linux 5.10.0-6-amd64 bullseye/sid
Noyau : #1 SMP Debian 5.10.28-1 (2021-04-09)
(G)UI : SDDM - Kwin - KDE - Plasma
Inscription : 24-04-2021

Re : [Non-Résolu] Installer le Dock I-Tec USB 3.0 sur ThinkPad P14S

Mon type de bureau :

$echo $DESKTOP_SESSION
plasma
$echo $XDG_CURRENT_DESKTOP
KDE
$echo $XDG_SESSION_TYPE
x11


$xrandr
Screen 0: minimum 320 x 200, current 3839 x 1080, maximum 16384 x 16384
eDP-1 connected primary 1920x1080+0+0 (normal left inverted right x axis y axis) 309mm x 173mm
   1920x1080     60.01*+  60.01    59.97    59.96    59.93  
   1680x1050     60.01    59.95    59.88  
   1600x1024     60.17  
   1400x1050     59.98  
   1600x900      59.99    59.94    59.95    59.82  
   1280x1024     60.01    60.02  
   1440x900      60.01    59.89  
   1400x900      59.96    59.88  
   1280x960      60.00  
   1440x810      60.00    59.97  
   1368x768      59.88    59.85  
   1360x768      59.80    59.96  
   1280x800      59.99    60.01    59.97    59.81    59.91  
   1152x864      60.00  
   1280x720      60.00    60.01    59.99    59.86    59.74  
   1024x768      60.01    60.04    60.00  
   960x720       60.00  
   928x696       60.05  
   896x672       60.01  
   1024x576      59.95    59.96    59.90    59.82  
   960x600       59.93    60.00  
   960x540       59.96    59.99    59.63    59.82  
   800x600       60.01    60.00    60.32    56.25  
   840x525       60.01    59.88  
   864x486       59.92    59.57  
   800x512       60.17  
   700x525       59.98  
   800x450       59.95    59.82  
   640x512       60.02  
   720x450       59.89  
   700x450       59.96    59.88  
   640x480       60.01    60.00    59.94  
   720x405       59.51    58.99  
   684x384       59.88    59.85  
   680x384       59.80    59.96  
   640x400       59.88    59.98  
   576x432       60.06  
   640x360       59.86    59.83    59.84    59.32  
   512x384       60.00  
   512x288       60.00    59.92  
   480x270       59.63    59.82  
   400x300       60.32    56.34  
   432x243       59.92    59.57  
   320x240       60.05  
   360x202       59.51    59.13  
   320x180       59.84    59.32  
HDMI-1 connected 1920x1080+1919+0 (normal left inverted right x axis y axis) 527mm x 296mm
   1920x1080     60.00 +  59.96    50.00    59.94*   59.93  
   1680x1050     69.88    59.95    59.88  
   1600x1024     60.17  
   1400x1050     74.76    70.00    59.98  
   1600x900      59.95    59.82  
   1280x1024     75.02    60.02  
   1440x900      59.89    59.90  
   1400x900      59.96    59.88  
   1280x960      60.00  
   1440x810      59.97  
   1368x768      59.88    59.85  
   1360x768      59.80    59.96  
   1280x800      59.99    60.00    59.97    59.81    59.91  
   1152x864      75.00    75.00    70.00    60.00  
   1280x720      60.00    59.99    59.86    60.00    50.00    59.94    59.74  
   1024x768      75.05    60.04    75.03    70.07    60.00  
   960x720       75.00    60.00  
   928x696       75.00    60.05  
   896x672       75.05    60.01  
   1024x576      59.95    59.96    59.90    59.82  
   960x600       59.93    60.00  
   832x624       74.55  
   960x540       59.96    59.99    59.63    59.82  
   800x600       75.00    70.00    65.00    60.00    72.19    75.00    60.32    56.25  
   840x525       74.96    69.88    60.01    59.88  
   864x486       59.92    59.57  
   720x576       50.00  
   800x512       60.17  
   700x525       74.76    70.06    59.98  
   800x450       59.95    59.82  
   720x480       60.00    59.94  
   640x512       75.02    60.02  
   720x450       59.89  
   700x450       59.96    59.88  
   640x480       60.00    75.00    72.81    75.00    66.67    60.00    59.94  
   720x405       59.51    58.99  
   720x400       70.08  
   684x384       59.88    59.85  
   680x384       59.80    59.96  
   640x400       59.88    59.98  
   576x432       75.00    75.00    70.00    60.06  
   640x360       59.86    59.83    59.84    59.32  
   512x384       75.03    70.07    60.00  
   512x288       60.00    59.92  
   416x312       74.66  
   480x270       59.63    59.82  
   400x300       72.19    75.12    60.32    56.34  
   432x243       59.92    59.57  
   320x240       72.81    75.00    60.05  
   360x202       59.51    59.13  
   320x180       59.84    59.32  
DP-1 disconnected (normal left inverted right x axis y axis)
DP-2 disconnected (normal left inverted right x axis y axis)



$lspci
00:00.0 Host bridge: Advanced Micro Devices, Inc. [AMD] Renoir Root Complex
00:00.2 IOMMU: Advanced Micro Devices, Inc. [AMD] Renoir IOMMU
00:01.0 Host bridge: Advanced Micro Devices, Inc. [AMD] Renoir PCIe Dummy Host Bridge
00:02.0 Host bridge: Advanced Micro Devices, Inc. [AMD] Renoir PCIe Dummy Host Bridge
00:02.1 PCI bridge: Advanced Micro Devices, Inc. [AMD] Renoir PCIe GPP Bridge
00:02.2 PCI bridge: Advanced Micro Devices, Inc. [AMD] Renoir PCIe GPP Bridge
00:02.3 PCI bridge: Advanced Micro Devices, Inc. [AMD] Renoir PCIe GPP Bridge
00:02.4 PCI bridge: Advanced Micro Devices, Inc. [AMD] Renoir PCIe GPP Bridge
00:02.6 PCI bridge: Advanced Micro Devices, Inc. [AMD] Renoir PCIe GPP Bridge
00:02.7 PCI bridge: Advanced Micro Devices, Inc. [AMD] Renoir PCIe GPP Bridge
00:08.0 Host bridge: Advanced Micro Devices, Inc. [AMD] Renoir PCIe Dummy Host Bridge
00:08.1 PCI bridge: Advanced Micro Devices, Inc. [AMD] Renoir Internal PCIe GPP Bridge to Bus
00:14.0 SMBus: Advanced Micro Devices, Inc. [AMD] FCH SMBus Controller (rev 51)
00:14.3 ISA bridge: Advanced Micro Devices, Inc. [AMD] FCH LPC Bridge (rev 51)
00:18.0 Host bridge: Advanced Micro Devices, Inc. [AMD] Renoir Device 24: Function 0
00:18.1 Host bridge: Advanced Micro Devices, Inc. [AMD] Renoir Device 24: Function 1
00:18.2 Host bridge: Advanced Micro Devices, Inc. [AMD] Renoir Device 24: Function 2
00:18.3 Host bridge: Advanced Micro Devices, Inc. [AMD] Renoir Device 24: Function 3
00:18.4 Host bridge: Advanced Micro Devices, Inc. [AMD] Renoir Device 24: Function 4
00:18.5 Host bridge: Advanced Micro Devices, Inc. [AMD] Renoir Device 24: Function 5
00:18.6 Host bridge: Advanced Micro Devices, Inc. [AMD] Renoir Device 24: Function 6
00:18.7 Host bridge: Advanced Micro Devices, Inc. [AMD] Renoir Device 24: Function 7
01:00.0 Non-Volatile memory controller: SK hynix Device 1639
02:00.0 Ethernet controller: Realtek Semiconductor Co., Ltd. RTL8111/8168/8411 PCI Express Gigabit Ethernet Controller (rev 0e)
02:00.1 Serial controller: Realtek Semiconductor Co., Ltd. RTL8111xP UART #1 (rev 0e)
02:00.2 Serial controller: Realtek Semiconductor Co., Ltd. RTL8111xP UART #2 (rev 0e)
02:00.3 IPMI Interface: Realtek Semiconductor Co., Ltd. RTL8111xP IPMI interface (rev 0e)
02:00.4 USB controller: Realtek Semiconductor Co., Ltd. RTL811x EHCI host controller (rev 0e)
03:00.0 Network controller: Intel Corporation Wi-Fi 6 AX200 (rev 1a)
04:00.0 Unassigned class [ff00]: Realtek Semiconductor Co., Ltd. RTS522A PCI Express Card Reader (rev 01)
05:00.0 Ethernet controller: Realtek Semiconductor Co., Ltd. RTL8111/8168/8411 PCI Express Gigabit Ethernet Controller (rev 15)
06:00.0 USB controller: Renesas Technology Corp. uPD720202 USB 3.0 Host Controller (rev 02)
07:00.0 VGA compatible controller: Advanced Micro Devices, Inc. [AMD/ATI] Renoir (rev d1)
07:00.1 Audio device: Advanced Micro Devices, Inc. [AMD/ATI] Device 1637
07:00.2 Encryption controller: Advanced Micro Devices, Inc. [AMD] Family 17h (Models 10h-1fh) Platform Security Processor
07:00.3 USB controller: Advanced Micro Devices, Inc. [AMD] Renoir USB 3.1
07:00.4 USB controller: Advanced Micro Devices, Inc. [AMD] Renoir USB 3.1
07:00.5 Multimedia controller: Advanced Micro Devices, Inc. [AMD] Raven/Raven2/FireFlight/Renoir Audio Processor (rev 01)
07:00.6 Audio device: Advanced Micro Devices, Inc. [AMD] Family 17h (Models 10h-1fh) HD Audio Controller


Jusqu'aux lèvres, la parole appartient à celui qui la donne,    ... ensuite elle appartient aussi à celui qui l'écoute
Lenovo ThinkPad P14s 8-Core AMD Ryzen 7 PRO 4750U with Radeon Graphics
OS1 : Debian bullseye/sid - 5.10.0-6-amd64 SMP Debian 5.10.28-1 (2021-04-09)
OS2 : Kubuntu 20.10 OS3 : openSUSE-Leap

Hors ligne

#6 09-05-2021 21:18:35

82(_)|\|0
Adhérent(e)
Lieu : 36300 LE BLANC
Distrib. : Linux 5.10.0-6-amd64 bullseye/sid
Noyau : #1 SMP Debian 5.10.28-1 (2021-04-09)
(G)UI : SDDM - Kwin - KDE - Plasma
Inscription : 24-04-2021

Re : [Non-Résolu] Installer le Dock I-Tec USB 3.0 sur ThinkPad P14S

Pour la connectique : i-tec USB 3.0/USB-C

Pour info je suis allé du côté de DisplayLink, j'ai modifié le fichier /etc/udev/rules.d/99-displaylink.rules
comme indiqué ici (pour ubuntu 21.04) :
https://support.displaylink.com/forums/ … ith-ubuntu

Sans succès

Jusqu'aux lèvres, la parole appartient à celui qui la donne,    ... ensuite elle appartient aussi à celui qui l'écoute
Lenovo ThinkPad P14s 8-Core AMD Ryzen 7 PRO 4750U with Radeon Graphics
OS1 : Debian bullseye/sid - 5.10.0-6-amd64 SMP Debian 5.10.28-1 (2021-04-09)
OS2 : Kubuntu 20.10 OS3 : openSUSE-Leap

Hors ligne

#7 10-05-2021 01:22:25

robert2a
Membre
Distrib. : debian 11
(G)UI : Mate
Inscription : 15-11-2014

Re : [Non-Résolu] Installer le Dock I-Tec USB 3.0 sur ThinkPad P14S

par contre en USB3 pas terrible le dock , a priori le débit est pas suffisant , vidéo ou 2 écran externe sur le dock
a priori pas de membre ici qui utilise un dock sous debian
tenter le dernier ubuntu sur un petit disque externe et tenter le ".run" du #1 , voir ce que ça donne
je n'ai aucune expérience sur ce matériel
vue ton retour de xrandr , voir le log de X  dans /var/log/Xorg.0.log  soit dans ton /home/#USER/.local/share/Xorg.0.log (ou  /home/#USER/.local/share/xorg/Xorg.0.log , me souvient plus )
tu dois retrouver les sorties eDP , HDMI et DP , par contre physiquement sur le portable je sais pas les connecteurs vidéo disponibles
pour le dock , l USB3  c'est 5Gb/s le débit max , mais la aussi pas trop d'expérience.
pour le noyau je pense que c'est bon , c'est le driver qui manque ,
pas logique avec ta remarque  =>  Les ports HDMI ont fonctionné en janvier sous Kubuntu 20.10
Kubuntu 20.10 a peu être installé le driver puis tu la perdu  hmm  (pour une raison inconnu )
ps: pour l'instant tu est bien en debian testing/sid ?
pour ceci :


Le Dock fonctionne pour les ports USB, la prise casque et la prise micro mais pas pour les ports HDMI
 


logique le noyau détecte bien le dock , mais il manque le traitement de la vidéo en usb3 vers le HDMI du dock
si quelqu'un a une expérience sur le sujet

Hors ligne

#8 10-05-2021 09:25:35

82(_)|\|0
Adhérent(e)
Lieu : 36300 LE BLANC
Distrib. : Linux 5.10.0-6-amd64 bullseye/sid
Noyau : #1 SMP Debian 5.10.28-1 (2021-04-09)
(G)UI : SDDM - Kwin - KDE - Plasma
Inscription : 24-04-2021

Re : [Non-Résolu] Installer le Dock I-Tec USB 3.0 sur ThinkPad P14S

J'ai trouvé un driver displaylink-debian sur GitHub là :
https://github.com/AdnanHodzic/displaylink-debian

Mais pas de pot ce matin :

$sudo apt update
Ign :1 http://deb.debian.org/debian bullseye-security InRelease
Ign :2 http://security.debian.org bullseye InRelease
Ign :3 http://security.debian.org bullseye-updates InRelease
Err :4 http://security.debian.org bullseye Release
  404  Not Found [IP : 2a04:4e42:6c::644 80]
Err :5 http://security.debian.org bullseye-updates Release
  404  Not Found [IP : 2a04:4e42:6c::644 80]
Err :6 http://deb.debian.org/debian bullseye-security Release
  404  Not Found [IP : 2a04:4e42:6c::644 80]
Lecture des listes de paquets... Fait
E: Le dépôt http://security.debian.org bullseye Release n'a pas de fichier Release.
N: Les mises à jour depuis un tel dépôt ne peuvent s'
effectuer de manière sécurisée, et sont donc désactivées par défaut.
N: Voir les pages de manuel d'apt-secure(8) pour la création des dépôts et les détails de configuration d'un utilisateur.
E: Le dépôt http://security.debian.org bullseye-updates Release n'a pas de fichier Release.
N: Les mises à jour depuis un tel dépôt ne peuvent s'
effectuer de manière sécurisée, et sont donc désactivées par défaut.
N: Voir les pages de manuel d'apt-secure(8) pour la création des dépôts et les détails de configuration d'un utilisateur.
E: Le dépôt http://deb.debian.org/debian bullseye-security Release n'a pas de fichier Release.
N: Les mises à jour depuis un tel dépôt ne peuvent s'
effectuer de manière sécurisée, et sont donc désactivées par défaut.
N: Voir les pages de manuel d'apt-secure(8) pour la création des dépôts et les détails de configuration d'un utilisateur


voici mon /etc/apt/sources.list !

deb http://security.debian.org/ bullseye main contrib non-free
deb-src http://security.debian.org/ bullseye main contrib non-free

deb http://deb.debian.org/debian/ bullseye-security main contrib non-free
deb-src http://deb.debian.org/debian/ bullseye-security main contrib non-free

# buster-updates, previously known as 'volatile'
deb http://security.debian.org/ bullseye-updates main contrib non-free
deb-src http://security.debian.org/ bullseye-updates main contrib non-free

# This system was installed using small removable media
# (e.g. netinst, live or single CD). The matching "deb cdrom"
# entries were disabled at the end of the installation process.
# For information about how to configure apt package sources,
# see the sources.list(5) manual.
deb http://security.debian.org/ trixie-security main contrib non-free
deb http://security.debian.org/ trixie-updates non-free


Or l'installation du driver me signale :


Checking dependencies

unzip is installed
linux-headers-5.10.0-6-amd64 is installed
dkms is installed
lsb-release is installed
dpkg-query: le paquet « linux-source » n'est pas installé et aucune information n'est disponible
Use dpkg --info (= dpkg-deb --info) to examine archive files.
linux-source not found! Install? [Y/n] n

Dernière modification par 82(_)|\|0 (10-05-2021 10:46:24)


Jusqu'aux lèvres, la parole appartient à celui qui la donne,    ... ensuite elle appartient aussi à celui qui l'écoute
Lenovo ThinkPad P14s 8-Core AMD Ryzen 7 PRO 4750U with Radeon Graphics
OS1 : Debian bullseye/sid - 5.10.0-6-amd64 SMP Debian 5.10.28-1 (2021-04-09)
OS2 : Kubuntu 20.10 OS3 : openSUSE-Leap

Hors ligne

#9 10-05-2021 10:51:53

82(_)|\|0
Adhérent(e)
Lieu : 36300 LE BLANC
Distrib. : Linux 5.10.0-6-amd64 bullseye/sid
Noyau : #1 SMP Debian 5.10.28-1 (2021-04-09)
(G)UI : SDDM - Kwin - KDE - Plasma
Inscription : 24-04-2021

Re : [Non-Résolu] Installer le Dock I-Tec USB 3.0 sur ThinkPad P14S

robert2a a écrit :

ps: pour l'instant tu est bien en debian testing/sid ?



$cat /etc/debian_version
bullseye/sid

Dernière modification par 82(_)|\|0 (10-05-2021 10:52:13)


Jusqu'aux lèvres, la parole appartient à celui qui la donne,    ... ensuite elle appartient aussi à celui qui l'écoute
Lenovo ThinkPad P14s 8-Core AMD Ryzen 7 PRO 4750U with Radeon Graphics
OS1 : Debian bullseye/sid - 5.10.0-6-amd64 SMP Debian 5.10.28-1 (2021-04-09)
OS2 : Kubuntu 20.10 OS3 : openSUSE-Leap

Hors ligne

#10 10-05-2021 16:05:45

82(_)|\|0
Adhérent(e)
Lieu : 36300 LE BLANC
Distrib. : Linux 5.10.0-6-amd64 bullseye/sid
Noyau : #1 SMP Debian 5.10.28-1 (2021-04-09)
(G)UI : SDDM - Kwin - KDE - Plasma
Inscription : 24-04-2021

Re : [Non-Résolu] Installer le Dock I-Tec USB 3.0 sur ThinkPad P14S

J'ai modifié mon source.list pour désactiver "debian-security" et ajouter les sources :

# Debian Buster, dépôt principal
deb http://ftp.fr.debian.org/debian/ bullseye main contrib non-free
deb-src http://ftp.fr.debian.org/debian/ bullseye main contrib non-free

# Debian Buster, mises à jour de sécurité
# deb http://deb.debian.org/debian-security/ bullseye-updates main contrib non-free
# deb-src http://deb.debian.org/debian-security/ bullseye-updates main contrib non-free

# Debian Buster, mises à jour "volatiles"
deb http://ftp.fr.debian.org/debian/ bullseye-updates main contrib non-free
deb-src http://ftp.fr.debian.org/debian/ bullseye-updates main contrib non-free

# Debian Buster, dépôt de rétroportages ("backports")
deb http://deb.debian.org/debian/ bullseye-backports main contrib non-free
deb-src http://deb.debian.org/debian/ bullseye-backports main contrib non-free


Jusqu'aux lèvres, la parole appartient à celui qui la donne,    ... ensuite elle appartient aussi à celui qui l'écoute
Lenovo ThinkPad P14s 8-Core AMD Ryzen 7 PRO 4750U with Radeon Graphics
OS1 : Debian bullseye/sid - 5.10.0-6-amd64 SMP Debian 5.10.28-1 (2021-04-09)
OS2 : Kubuntu 20.10 OS3 : openSUSE-Leap

Hors ligne

#11 10-05-2021 16:58:38

82(_)|\|0
Adhérent(e)
Lieu : 36300 LE BLANC
Distrib. : Linux 5.10.0-6-amd64 bullseye/sid
Noyau : #1 SMP Debian 5.10.28-1 (2021-04-09)
(G)UI : SDDM - Kwin - KDE - Plasma
Inscription : 24-04-2021

Re : [Non-Résolu] Installer le Dock I-Tec USB 3.0 sur ThinkPad P14S

$ sudo apt-get install git
$ git clone https://github.com/AdnanHodzic/displaylink-debian.git
$ cd displaylink-debian/
$ sudo ./displaylink-debian.sh


Tout semble bien installé mais après reboot, les ports HDMI du dock ne fonctionnent toujours pas.

Dernière modification par 82(_)|\|0 (10-05-2021 18:29:01)


Jusqu'aux lèvres, la parole appartient à celui qui la donne,    ... ensuite elle appartient aussi à celui qui l'écoute
Lenovo ThinkPad P14s 8-Core AMD Ryzen 7 PRO 4750U with Radeon Graphics
OS1 : Debian bullseye/sid - 5.10.0-6-amd64 SMP Debian 5.10.28-1 (2021-04-09)
OS2 : Kubuntu 20.10 OS3 : openSUSE-Leap

Hors ligne

#12 10-05-2021 19:38:58

robert2a
Membre
Distrib. : debian 11
(G)UI : Mate
Inscription : 15-11-2014

Re : [Non-Résolu] Installer le Dock I-Tec USB 3.0 sur ThinkPad P14S

Bonjour
la compilation c'est bien passé ?  avec la commande "./displaylink-debian.sh"
tu a gardé le log ?

Hors ligne

#13 11-05-2021 08:12:48

82(_)|\|0
Adhérent(e)
Lieu : 36300 LE BLANC
Distrib. : Linux 5.10.0-6-amd64 bullseye/sid
Noyau : #1 SMP Debian 5.10.28-1 (2021-04-09)
(G)UI : SDDM - Kwin - KDE - Plasma
Inscription : 24-04-2021

Re : [Non-Résolu] Installer le Dock I-Tec USB 3.0 sur ThinkPad P14S

Voici ce que m'a retourné le terminal :

$sudo bash ./displaylink-driver-5.4.0-55.153.run
[sudo] Mot de passe de bruno :
Verifying archive integrity...  100%   All good.
Uncompressing DisplayLink Linux Driver 5.4.0-55.153  100%  
DisplayLink Linux Software 5.4.0-55.153 install script called:
Distribution discovered: Debian GNU/Linux bullseye/sid

Installing

[ Installing EVDI ]
[[ Installing EVDI DKMS module ]]

Creating symlink /var/lib/dkms/evdi/1.9.1/source ->
                 /usr/src/evdi-1.9.1

DKMS: add completed.

Kernel preparation unnecessary for this kernel.  Skipping...

Building module:
cleaning build area...
make -j16 KERNELRELEASE=5.10.0-6-amd64 all INCLUDEDIR=/lib/modules/5.10.0-6-amd64/build/include KVERSION=5.10.0-6-amd64 DKMS_BUILD=1...
cleaning build area...

DKMS: build completed.

evdi.ko:
Running module version sanity check.
 - Original module
   - No original module exists within this kernel
 - Installation
   - Installing to /lib/modules/5.10.0-6-amd64/updates/dkms/

depmod...

DKMS: install completed.
[[ Installing module configuration files ]]
[[ Installing EVDI library ]]
cc -I../module -std=gnu99 -fPIC -D_FILE_OFFSET_BITS=64    -c -o evdi_lib.o evdi_lib.c
cc evdi_lib.o -shared -Wl,-soname,libevdi.so.0 -o libevdi.so.1.9.1 -lc -lgcc
cp libevdi.so.1.9.1 libevdi.so
[ Installing x64-ubuntu-1604/DisplayLinkManager ]
[ Installing libraries ]
[ Installing firmware packages ]
[ Installing licence file ]
[ Adding udev rule for DisplayLink DL-3xxx/4xxx/5xxx/6xxx devices ]
[ Adding upstart and powermanager sctripts ]

Please read the FAQ
http://support.displaylink.com/knowledgebase/topics/103927-troubleshooting-ubuntu

Installation complete!

Please reboot your computer if intending to use Xorg.
Xorg is running. Do you want to reboot now? (Y/n)



Rien de neuf après le reboot...


Jusqu'aux lèvres, la parole appartient à celui qui la donne,    ... ensuite elle appartient aussi à celui qui l'écoute
Lenovo ThinkPad P14s 8-Core AMD Ryzen 7 PRO 4750U with Radeon Graphics
OS1 : Debian bullseye/sid - 5.10.0-6-amd64 SMP Debian 5.10.28-1 (2021-04-09)
OS2 : Kubuntu 20.10 OS3 : openSUSE-Leap

Hors ligne

#14 11-05-2021 14:06:21

robert2a
Membre
Distrib. : debian 11
(G)UI : Mate
Inscription : 15-11-2014

Re : [Non-Résolu] Installer le Dock I-Tec USB 3.0 sur ThinkPad P14S

Bonjour
vue la fin du log tu a jeter un oeil sur le log de X  (sur kde qui dois être soit dans ton /home/$USER/.local/ , soit dans /var/log/Xorg.0.log )
a priori l'installation a l'air correcte .

le module doit être dans /lib/modules/5.10.0-6-amd64/updates/dkms/

des erreurs ?


journalctl -r -p err
 



ceci (faq)  =>  https://support.displaylink.com/knowled … ing-ubuntu

Dernière modification par robert2a (11-05-2021 14:09:06)

Hors ligne

#15 11-05-2021 14:20:50

robert2a
Membre
Distrib. : debian 11
(G)UI : Mate
Inscription : 15-11-2014

Re : [Non-Résolu] Installer le Dock I-Tec USB 3.0 sur ThinkPad P14S

trouver ceci aussi => https://www.displaylink.com/downloads/file?d=310
=> https://www.displaylink.org/forum/showt … hp?t=67148

trouver sur un commentaire sur le site de vente en ligne "LDLC" sur ce matériel

Hors ligne

#16 13-05-2021 18:58:09

82(_)|\|0
Adhérent(e)
Lieu : 36300 LE BLANC
Distrib. : Linux 5.10.0-6-amd64 bullseye/sid
Noyau : #1 SMP Debian 5.10.28-1 (2021-04-09)
(G)UI : SDDM - Kwin - KDE - Plasma
Inscription : 24-04-2021

Re : [Non-Résolu] Installer le Dock I-Tec USB 3.0 sur ThinkPad P14S

Je suis allé chercher le patch sur le site : https://www.displaylink.com/downloads/file?d=310

et je l'ai exécuté :

$ sudo dpkg -i xserver-xorg-core_1.20.8-2ubuntu2_amd64.deb
dpkg: avertissement: dégradation (« downgrade ») de xserver-xorg-core depuis 2:1.20.11-1 vers 2:1.20.8-2ubuntu2
(Lecture de la base de données... 456041 fichiers et répertoires déjà installés.)
Préparation du dépaquetage de xserver-xorg-core_1.20.8-2ubuntu2_amd64.deb ...
Dépaquetage de xserver-xorg-core (2:1.20.8-2ubuntu2) sur (2:1.20.11-1) ...
Paramétrage de xserver-xorg-core (2:1.20.8-2ubuntu2) ...
Traitement des actions différées (« triggers ») pour man-db (2.9.4-2) ...



Tout semble Ok, je reboote ...

C'est résolu ! Je peux à nouveau gérer mes 3 écrans (jusqu'à la prochaine mise à jour ?)

Pour information : lorsque je branche mes deux écrans supplémentaires sur le dock, tout fonctionne au ralenti (USB3).
Lorsque je branche 1 écran sur le dock et l'autre sur la prise HDMI de mon Thinkpad, c'est tout à fait correct.

Suite à mes réclamations, LDLC vient de me proposer de me rembourser le dock.
Mais comme ça fonctionne, je vais le garder...


Merci Débian-Facile !merci.gif

Dernière modification par 82(_)|\|0 (18-05-2021 14:00:04)


Jusqu'aux lèvres, la parole appartient à celui qui la donne,    ... ensuite elle appartient aussi à celui qui l'écoute
Lenovo ThinkPad P14s 8-Core AMD Ryzen 7 PRO 4750U with Radeon Graphics
OS1 : Debian bullseye/sid - 5.10.0-6-amd64 SMP Debian 5.10.28-1 (2021-04-09)
OS2 : Kubuntu 20.10 OS3 : openSUSE-Leap

Hors ligne

#17 21-05-2021 06:38:45

82(_)|\|0
Adhérent(e)
Lieu : 36300 LE BLANC
Distrib. : Linux 5.10.0-6-amd64 bullseye/sid
Noyau : #1 SMP Debian 5.10.28-1 (2021-04-09)
(G)UI : SDDM - Kwin - KDE - Plasma
Inscription : 24-04-2021

Re : [Non-Résolu] Installer le Dock I-Tec USB 3.0 sur ThinkPad P14S

Ça ne fonctionne plus.
Est-ce à cause de la mie à jour d'Xserver ?
Plus rien sur les prises HDMI du dock.
Je passe en non résolu scratchhead.gif

Jusqu'aux lèvres, la parole appartient à celui qui la donne,    ... ensuite elle appartient aussi à celui qui l'écoute
Lenovo ThinkPad P14s 8-Core AMD Ryzen 7 PRO 4750U with Radeon Graphics
OS1 : Debian bullseye/sid - 5.10.0-6-amd64 SMP Debian 5.10.28-1 (2021-04-09)
OS2 : Kubuntu 20.10 OS3 : openSUSE-Leap

Hors ligne

#18 21-05-2021 15:34:15

robert2a
Membre
Distrib. : debian 11
(G)UI : Mate
Inscription : 15-11-2014

Re : [Non-Résolu] Installer le Dock I-Tec USB 3.0 sur ThinkPad P14S

Bonjour
pour ta remarque ça confirme ce que j'ai lut sur le net  (le débit de l' USB3 du dock est insuffisant )


Pour information : lorsque je branche mes deux écrans supplémentaires sur le dock, tout fonctionne au ralenti (USB3).
Lorsque je branche 1 écran sur le dock et l'autre sur la prise HDMI de mon Thinkpad, c'est tout à fait correct.
 


sur une sid actuellement j'ai cette version (identique sur sid et testing )


apt policy xserver-xorg-core
xserver-xorg-core:
  Installé : 2:1.20.11-1
  Candidat : 2:1.20.11-1
 Table de version :
 *** 2:1.20.11-1 500
        500 https://deb.debian.org/debian bullseye/main amd64 Packages
        500 https://deb.debian.org/debian sid/main amd64 Packages
        100 /var/lib/dpkg/status
 



tu peu vérifier la version installé actuellement sur ta machine (pour vérifier => "Est-ce à cause de la mie à jour d'Xserver ?"  )


tu pourrais bloquer ce paquet provisoirement pour qu'il ne soit plus mit a jour (et garder la version du patch "ubuntu")
il te faut recommencer ta commande


$ sudo dpkg -i xserver-xorg-core_1.20.8-2ubuntu2_amd64.deb
 

Hors ligne

#19 26-05-2021 22:29:11

82(_)|\|0
Adhérent(e)
Lieu : 36300 LE BLANC
Distrib. : Linux 5.10.0-6-amd64 bullseye/sid
Noyau : #1 SMP Debian 5.10.28-1 (2021-04-09)
(G)UI : SDDM - Kwin - KDE - Plasma
Inscription : 24-04-2021

Re : [Non-Résolu] Installer le Dock I-Tec USB 3.0 sur ThinkPad P14S

Bonsoir robert2a,

$ apt policy xserver-xorg-core
xserver-xorg-core:
  Installé : 2:1.20.11-1
  Candidat : 2:1.20.11-1
 Table de version :
 *** 2:1.20.11-1 500
        500 http://ftp.fr.debian.org/debian bullseye/main amd64 Packages
        100 /var/lib/dpkg/status



Comme toi smile

$ cd /chemein vers/DisplayLinkXServerPatch/
$ sudo dpkg -i xserver-xorg-core_1.20.8-2ubuntu2_amd64.deb
dpkg: avertissement: dégradation (« downgrade ») de xserver-xorg-core depuis 2:1.20.11-1 vers 2:1.20.8-2ubuntu2
(Lecture de la base de données... 456377 fichiers et répertoires déjà installés.)
Préparation du dépaquetage de xserver-xorg-core_1.20.8-2ubuntu2_amd64.deb ...
Dépaquetage de xserver-xorg-core (2:1.20.8-2ubuntu2) sur (2:1.20.11-1) ...
Paramétrage de xserver-xorg-core (2:1.20.8-2ubuntu2) ...
Traitement des actions différées (« triggers ») pour man-db (2.9.4-2) ...



Vérification du changement :

$ apt policy xserver-xorg-core
xserver-xorg-core:
  Installé : 2:1.20.8-2ubuntu2
  Candidat : 2:1.20.11-1
 Table de version :
     2:1.20.11-1 500
        500 http://ftp.fr.debian.org/debian bullseye/main amd64 Packages
 *** 2:1.20.8-2ubuntu2 100
        100 /var/lib/dpkg/status



Reboot et pas mieux...


Jusqu'aux lèvres, la parole appartient à celui qui la donne,    ... ensuite elle appartient aussi à celui qui l'écoute
Lenovo ThinkPad P14s 8-Core AMD Ryzen 7 PRO 4750U with Radeon Graphics
OS1 : Debian bullseye/sid - 5.10.0-6-amd64 SMP Debian 5.10.28-1 (2021-04-09)
OS2 : Kubuntu 20.10 OS3 : openSUSE-Leap

Hors ligne

Pied de page des forums