Debian Debian-France Debian-Facile Debian-fr.org Debian-fr.xyz Debian ? Communautés

Debian-facile

Bienvenue sur Debian-Facile, site d'aide pour les nouveaux utilisateurs de Debian.

Vous n'êtes pas identifié(e).

#1 28-09-2021 19:29:25

ouatou
Membre
Distrib. : bookworm
Noyau : Linux 5.14.0-1-amd64
(G)UI : gnome
Inscription : 07-11-2014

reinstallation driver graphique compliqué debian testing

Bonjour a tous,

je rencontre un soucis au niveau de la mise a jour notement celle des driver graphique qui echou, je les ai donc suprimer pour avoir une interface graphique convenable au reboot car je me suis retrouvé avec une interface graphique dans une resolutions tres desagreable et dans limpossibilité d'en changer.

aptitude update && aptitude upgrade


Atteint http://deb.debian.org/debian bookworm InRelease
Atteint http://deb.debian.org/debian-security bookworm-security/updates InRelease
Atteint http://deb.debian.org/debian bookworm-updates InRelease
Atteint http://debug.mirrors.debian.org/debian-debug bookworm-debug InRelease
                                                       
Aucun paquet ne va être installé, mis à jour ou enlevé.
0 paquets mis à jour, 0 nouvellement installés, 0 à enlever et 0 non mis à jour.
Il est nécessaire de télécharger 0 o d'archives. Après dépaquetage, 0 o seront utilisés.
 



donc ensuite j'ai voulu les réinstaller

apt install nvidia-driver firmware-misc-nonfree


firmware-misc-nonfree est déjà installé avec la version demandée (20210818-1)
firmware-misc-nonfree est déjà installé avec la version demandée (20210818-1)
Les NOUVEAUX paquets suivants vont être installés :
  dctrl-tools{a} dkms{a} glx-alternative-mesa{a} glx-alternative-nvidia{a}
  glx-diversions{a} libcuda1{a} libcuda1:i386{a} libegl-mesa0:i386{a}
  libegl-nvidia0{a} libegl-nvidia0:i386{a} libegl1:i386{a}
  libgl1-nvidia-glvnd-glx{a} libgl1-nvidia-glvnd-glx:i386{a}
  libgles-nvidia1{a} libgles-nvidia1:i386{a} libgles-nvidia2{a}
  libgles-nvidia2:i386{a} libgles1{a} libgles1:i386{a} libgles2:i386{a}
  libglx-nvidia0{a} libglx-nvidia0:i386{a} libnvcuvid1{a}
  libnvcuvid1:i386{a} libnvidia-cbl{a} libnvidia-cfg1{a}
  libnvidia-eglcore{a} libnvidia-eglcore:i386{a} libnvidia-encode1{a}
  libnvidia-encode1:i386{a} libnvidia-glcore{a} libnvidia-glvkspirv{a}
  libnvidia-glvkspirv:i386{a} libnvidia-ml1{a} libnvidia-ptxjitcompiler1{a}
  libnvidia-ptxjitcompiler1:i386{a} libnvidia-rtcore{a} libopengl0{a}
  libopengl0:i386{a} linux-headers-amd64{a} nvidia-alternative{a}
  nvidia-driver nvidia-driver-bin{a} nvidia-driver-libs{a}
  nvidia-driver-libs:i386{a} nvidia-egl-common{a} nvidia-egl-icd{a}
  nvidia-egl-icd:i386{a} nvidia-installer-cleanup{a}
  nvidia-kernel-common{a} nvidia-kernel-dkms{a} nvidia-kernel-support{a}
  nvidia-legacy-check{a} nvidia-modprobe{a} nvidia-persistenced{a}
  nvidia-settings{a} nvidia-smi{a} nvidia-support{a} nvidia-vdpau-driver{a}
  nvidia-vulkan-common{a} nvidia-vulkan-icd{a} nvidia-vulkan-icd:i386{a}
  update-glx{a} xserver-xorg-video-nvidia{a}
0 paquets mis à jour, 64 nouvellement installés, 0 à enlever et 0 non mis à jour.
Il est nécessaire de télécharger 0 o/122 Mo d'archives. Après dépaquetage, 413 Mo seront utilisés.
Voulez-vous continuer ? [Y/n/?] y
Extraction des modèles depuis les paquets : 100%
Préconfiguration des paquets...
(Lecture de la base de données... 206069 fichiers et répertoires déjà installés.)
Préparation du dépaquetage de .../dctrl-tools_2.24-3+b1_amd64.deb ...
Dépaquetage de dctrl-tools (2.24-3+b1) ...
Préparation du dépaquetage de .../archives/dkms_2.8.4-4_all.deb ...
Dépaquetage de dkms (2.8.4-4) ...
Préparation du dépaquetage de .../update-glx_1.2.0_amd64.deb ...
Dépaquetage de update-glx (1.2.0) ...
Préparation du dépaquetage de .../glx-alternative-mesa_1.2.0_amd64.deb ...
Dépaquetage de glx-alternative-mesa (1.2.0) ...
Sélection du paquet nvidia-installer-cleanup précédemment désélectionné.
Préparation du dépaquetage de .../nvidia-installer-cleanup_20151021+13_amd64.deb ...
Dépaquetage de nvidia-installer-cleanup (20151021+13) ...
Paramétrage de nvidia-installer-cleanup (20151021+13) ...
Sélection du paquet glx-diversions précédemment désélectionné.
(Lecture de la base de données... 206275 fichiers et répertoires déjà installés.)
Préparation du dépaquetage de .../glx-diversions_1.2.0_amd64.deb ...
Dépaquetage de glx-diversions (1.2.0) ...
Sélection du paquet glx-alternative-nvidia précédemment désélectionné.
Préparation du dépaquetage de .../glx-alternative-nvidia_1.2.0_amd64.deb ...
Dépaquetage de glx-alternative-nvidia (1.2.0) ...
Sélection du paquet nvidia-legacy-check précédemment désélectionné.
Préparation du dépaquetage de .../nvidia-legacy-check_470.57.02-2_amd64.deb ...
Dépaquetage de nvidia-legacy-check (470.57.02-2) ...
Sélection du paquet nvidia-support précédemment désélectionné.
Préparation du dépaquetage de .../nvidia-support_20151021+13_amd64.deb ...
Dépaquetage de nvidia-support (20151021+13) ...
Paramétrage de nvidia-legacy-check (470.57.02-2) ...
Sélection du paquet nvidia-alternative précédemment désélectionné.
(Lecture de la base de données... 206313 fichiers et répertoires déjà installés.)
Préparation du dépaquetage de .../00-nvidia-alternative_470.57.02-2_amd64.deb ...
Dépaquetage de nvidia-alternative (470.57.02-2) ...
Sélection du paquet libnvidia-ptxjitcompiler1:amd64 précédemment désélectionné.
Préparation du dépaquetage de .../01-libnvidia-ptxjitcompiler1_470.57.02-2_amd64.deb ...
Dépaquetage de libnvidia-ptxjitcompiler1:amd64 (470.57.02-2) ...
Sélection du paquet libcuda1:amd64 précédemment désélectionné.
Préparation du dépaquetage de .../02-libcuda1_470.57.02-2_amd64.deb ...
Dépaquetage de libcuda1:amd64 (470.57.02-2) ...
Sélection du paquet libnvidia-glcore:amd64 précédemment désélectionné.
Préparation du dépaquetage de .../03-libnvidia-glcore_470.57.02-2_amd64.deb ...
Dépaquetage de libnvidia-glcore:amd64 (470.57.02-2) ...
Sélection du paquet libnvidia-eglcore:amd64 précédemment désélectionné.
Préparation du dépaquetage de .../04-libnvidia-eglcore_470.57.02-2_amd64.deb ...
Dépaquetage de libnvidia-eglcore:amd64 (470.57.02-2) ...
Sélection du paquet libglx-nvidia0:amd64 précédemment désélectionné.
Préparation du dépaquetage de .../05-libglx-nvidia0_470.57.02-2_amd64.deb ...
Dépaquetage de libglx-nvidia0:amd64 (470.57.02-2) ...
Sélection du paquet libgl1-nvidia-glvnd-glx:amd64 précédemment désélectionné.
Préparation du dépaquetage de .../06-libgl1-nvidia-glvnd-glx_470.57.02-2_amd64.deb ...
Dépaquetage de libgl1-nvidia-glvnd-glx:amd64 (470.57.02-2) ...
Sélection du paquet nvidia-egl-common précédemment désélectionné.
Préparation du dépaquetage de .../07-nvidia-egl-common_470.57.02-2_amd64.deb ...
Dépaquetage de nvidia-egl-common (470.57.02-2) ...
Sélection du paquet libegl-nvidia0:amd64 précédemment désélectionné.
Préparation du dépaquetage de .../08-libegl-nvidia0_470.57.02-2_amd64.deb ...
Dépaquetage de libegl-nvidia0:amd64 (470.57.02-2) ...
Sélection du paquet nvidia-egl-icd:amd64 précédemment désélectionné.
Préparation du dépaquetage de .../09-nvidia-egl-icd_470.57.02-2_amd64.deb ...
Dépaquetage de nvidia-egl-icd:amd64 (470.57.02-2) ...
Sélection du paquet nvidia-driver-libs:amd64 précédemment désélectionné.
Préparation du dépaquetage de .../10-nvidia-driver-libs_470.57.02-2_amd64.deb ...
Dépaquetage de nvidia-driver-libs:amd64 (470.57.02-2) ...
Sélection du paquet libnvidia-ml1:amd64 précédemment désélectionné.
Préparation du dépaquetage de .../11-libnvidia-ml1_470.57.02-2_amd64.deb ...
Dépaquetage de libnvidia-ml1:amd64 (470.57.02-2) ...
Sélection du paquet nvidia-driver-bin précédemment désélectionné.
Préparation du dépaquetage de .../12-nvidia-driver-bin_470.57.02-2_amd64.deb ...
Dépaquetage de nvidia-driver-bin (470.57.02-2) ...
Sélection du paquet xserver-xorg-video-nvidia précédemment désélectionné.
Préparation du dépaquetage de .../13-xserver-xorg-video-nvidia_470.57.02-2_amd64.deb ...
Dépaquetage de xserver-xorg-video-nvidia (470.57.02-2) ...
Sélection du paquet nvidia-vdpau-driver:amd64 précédemment désélectionné.
Préparation du dépaquetage de .../14-nvidia-vdpau-driver_470.57.02-2_amd64.deb ...
Dépaquetage de nvidia-vdpau-driver:amd64 (470.57.02-2) ...
Sélection du paquet nvidia-kernel-common précédemment désélectionné.
Préparation du dépaquetage de .../15-nvidia-kernel-common_20151021+13_amd64.deb ...
Dépaquetage de nvidia-kernel-common (20151021+13) ...
Sélection du paquet nvidia-modprobe précédemment désélectionné.
Préparation du dépaquetage de .../16-nvidia-modprobe_470.57.02-1_amd64.deb ...
Dépaquetage de nvidia-modprobe (470.57.02-1) ...
Sélection du paquet nvidia-kernel-support précédemment désélectionné.
Préparation du dépaquetage de .../17-nvidia-kernel-support_470.57.02-2_amd64.deb ...
Dépaquetage de nvidia-kernel-support (470.57.02-2) ...
Sélection du paquet nvidia-kernel-dkms précédemment désélectionné.
Préparation du dépaquetage de .../18-nvidia-kernel-dkms_470.57.02-2_amd64.deb ...
Dépaquetage de nvidia-kernel-dkms (470.57.02-2) ...
Sélection du paquet nvidia-driver précédemment désélectionné.
Préparation du dépaquetage de .../19-nvidia-driver_470.57.02-2_amd64.deb ...
Dépaquetage de nvidia-driver (470.57.02-2) ...
Sélection du paquet libnvidia-cfg1:amd64 précédemment désélectionné.
Préparation du dépaquetage de .../20-libnvidia-cfg1_470.57.02-2_amd64.deb ...
Dépaquetage de libnvidia-cfg1:amd64 (470.57.02-2) ...
Sélection du paquet nvidia-persistenced précédemment désélectionné.
Préparation du dépaquetage de .../21-nvidia-persistenced_470.57.02-1_amd64.deb ...
Dépaquetage de nvidia-persistenced (470.57.02-1) ...
Sélection du paquet nvidia-settings précédemment désélectionné.
Préparation du dépaquetage de .../22-nvidia-settings_470.57.02-2_amd64.deb ...
Dépaquetage de nvidia-settings (470.57.02-2) ...
Sélection du paquet libnvidia-ptxjitcompiler1:i386 précédemment désélectionné.
Préparation du dépaquetage de .../23-libnvidia-ptxjitcompiler1_470.57.02-2_i386.deb ...
Dépaquetage de libnvidia-ptxjitcompiler1:i386 (470.57.02-2) ...
Sélection du paquet libcuda1:i386 précédemment désélectionné.
Préparation du dépaquetage de .../24-libcuda1_470.57.02-2_i386.deb ...
Dépaquetage de libcuda1:i386 (470.57.02-2) ...
Sélection du paquet libegl-mesa0:i386 précédemment désélectionné.
Préparation du dépaquetage de .../25-libegl-mesa0_20.3.5-1_i386.deb ...
Dépaquetage de libegl-mesa0:i386 (20.3.5-1) ...
Sélection du paquet libnvidia-eglcore:i386 précédemment désélectionné.
Préparation du dépaquetage de .../26-libnvidia-eglcore_470.57.02-2_i386.deb ...
Dépaquetage de libnvidia-eglcore:i386 (470.57.02-2) ...
Sélection du paquet libegl-nvidia0:i386 précédemment désélectionné.
Préparation du dépaquetage de .../27-libegl-nvidia0_470.57.02-2_i386.deb ...
Dépaquetage de libegl-nvidia0:i386 (470.57.02-2) ...
Sélection du paquet libglx-nvidia0:i386 précédemment désélectionné.
Préparation du dépaquetage de .../28-libglx-nvidia0_470.57.02-2_i386.deb ...
Dépaquetage de libglx-nvidia0:i386 (470.57.02-2) ...
Sélection du paquet libgl1-nvidia-glvnd-glx:i386 précédemment désélectionné.
Préparation du dépaquetage de .../29-libgl1-nvidia-glvnd-glx_470.57.02-2_i386.deb ...
Dépaquetage de libgl1-nvidia-glvnd-glx:i386 (470.57.02-2) ...
Sélection du paquet libgles1:i386 précédemment désélectionné.
Préparation du dépaquetage de .../30-libgles1_1.3.4-2+b1_i386.deb ...
Dépaquetage de libgles1:i386 (1.3.4-2+b1) ...
Sélection du paquet libgles-nvidia1:i386 précédemment désélectionné.
Préparation du dépaquetage de .../31-libgles-nvidia1_470.57.02-2_i386.deb ...
Dépaquetage de libgles-nvidia1:i386 (470.57.02-2) ...
Sélection du paquet libgles1:amd64 précédemment désélectionné.
Préparation du dépaquetage de .../32-libgles1_1.3.4-2+b1_amd64.deb ...
Dépaquetage de libgles1:amd64 (1.3.4-2+b1) ...
Sélection du paquet libgles-nvidia1:amd64 précédemment désélectionné.
Préparation du dépaquetage de .../33-libgles-nvidia1_470.57.02-2_amd64.deb ...
Dépaquetage de libgles-nvidia1:amd64 (470.57.02-2) ...
Sélection du paquet libgles2:i386 précédemment désélectionné.
Préparation du dépaquetage de .../34-libgles2_1.3.4-2+b1_i386.deb ...
Dépaquetage de libgles2:i386 (1.3.4-2+b1) ...
Sélection du paquet libgles-nvidia2:i386 précédemment désélectionné.
Préparation du dépaquetage de .../35-libgles-nvidia2_470.57.02-2_i386.deb ...
Dépaquetage de libgles-nvidia2:i386 (470.57.02-2) ...
Sélection du paquet libgles-nvidia2:amd64 précédemment désélectionné.
Préparation du dépaquetage de .../36-libgles-nvidia2_470.57.02-2_amd64.deb ...
Dépaquetage de libgles-nvidia2:amd64 (470.57.02-2) ...
Sélection du paquet libnvcuvid1:i386 précédemment désélectionné.
Préparation du dépaquetage de .../37-libnvcuvid1_470.57.02-2_i386.deb ...
Dépaquetage de libnvcuvid1:i386 (470.57.02-2) ...
Sélection du paquet libnvcuvid1:amd64 précédemment désélectionné.
Préparation du dépaquetage de .../38-libnvcuvid1_470.57.02-2_amd64.deb ...
Dépaquetage de libnvcuvid1:amd64 (470.57.02-2) ...
Sélection du paquet libnvidia-cbl:amd64 précédemment désélectionné.
Préparation du dépaquetage de .../39-libnvidia-cbl_470.57.02-2_amd64.deb ...
Dépaquetage de libnvidia-cbl:amd64 (470.57.02-2) ...
Sélection du paquet libnvidia-encode1:amd64 précédemment désélectionné.
Préparation du dépaquetage de .../40-libnvidia-encode1_470.57.02-2_amd64.deb ...
Dépaquetage de libnvidia-encode1:amd64 (470.57.02-2) ...
Sélection du paquet libnvidia-encode1:i386 précédemment désélectionné.
Préparation du dépaquetage de .../41-libnvidia-encode1_470.57.02-2_i386.deb ...
Dépaquetage de libnvidia-encode1:i386 (470.57.02-2) ...
Sélection du paquet libnvidia-glvkspirv:amd64 précédemment désélectionné.
Préparation du dépaquetage de .../42-libnvidia-glvkspirv_470.57.02-2_amd64.deb ...
Dépaquetage de libnvidia-glvkspirv:amd64 (470.57.02-2) ...
Sélection du paquet libnvidia-glvkspirv:i386 précédemment désélectionné.
Préparation du dépaquetage de .../43-libnvidia-glvkspirv_470.57.02-2_i386.deb ...
Dépaquetage de libnvidia-glvkspirv:i386 (470.57.02-2) ...
Sélection du paquet libnvidia-rtcore:amd64 précédemment désélectionné.
Préparation du dépaquetage de .../44-libnvidia-rtcore_470.57.02-2_amd64.deb ...
Dépaquetage de libnvidia-rtcore:amd64 (470.57.02-2) ...
Préparation du dépaquetage de .../45-linux-headers-amd64_5.14.6-2_amd64.deb ...
Dépaquetage de linux-headers-amd64 (5.14.6-2) ...
Sélection du paquet libegl1:i386 précédemment désélectionné.
Préparation du dépaquetage de .../46-libegl1_1.3.4-2+b1_i386.deb ...
Dépaquetage de libegl1:i386 (1.3.4-2+b1) ...
Sélection du paquet nvidia-egl-icd:i386 précédemment désélectionné.
Préparation du dépaquetage de .../47-nvidia-egl-icd_470.57.02-2_i386.deb ...
Dépaquetage de nvidia-egl-icd:i386 (470.57.02-2) ...
Sélection du paquet nvidia-driver-libs:i386 précédemment désélectionné.
Préparation du dépaquetage de .../48-nvidia-driver-libs_470.57.02-2_i386.deb ...
Dépaquetage de nvidia-driver-libs:i386 (470.57.02-2) ...
Sélection du paquet nvidia-smi précédemment désélectionné.
Préparation du dépaquetage de .../49-nvidia-smi_470.57.02-2_amd64.deb ...
Dépaquetage de nvidia-smi (470.57.02-2) ...
Sélection du paquet nvidia-vulkan-common précédemment désélectionné.
Préparation du dépaquetage de .../50-nvidia-vulkan-common_470.57.02-2_amd64.deb ...
Dépaquetage de nvidia-vulkan-common (470.57.02-2) ...
Sélection du paquet nvidia-vulkan-icd:i386 précédemment désélectionné.
Préparation du dépaquetage de .../51-nvidia-vulkan-icd_470.57.02-2_i386.deb ...
Dépaquetage de nvidia-vulkan-icd:i386 (470.57.02-2) ...
Sélection du paquet nvidia-vulkan-icd:amd64 précédemment désélectionné.
Préparation du dépaquetage de .../52-nvidia-vulkan-icd_470.57.02-2_amd64.deb ...
Dépaquetage de nvidia-vulkan-icd:amd64 (470.57.02-2) ...
Sélection du paquet libopengl0:i386 précédemment désélectionné.
Préparation du dépaquetage de .../53-libopengl0_1.3.4-2+b1_i386.deb ...
Dépaquetage de libopengl0:i386 (1.3.4-2+b1) ...
Sélection du paquet libopengl0:amd64 précédemment désélectionné.
Préparation du dépaquetage de .../54-libopengl0_1.3.4-2+b1_amd64.deb ...
Dépaquetage de libopengl0:amd64 (1.3.4-2+b1) ...
Paramétrage de nvidia-support (20151021+13) ...
Paramétrage de libnvidia-glvkspirv:amd64 (470.57.02-2) ...
Paramétrage de libnvidia-glvkspirv:i386 (470.57.02-2) ...
Paramétrage de libnvidia-eglcore:amd64 (470.57.02-2) ...
Paramétrage de libnvidia-eglcore:i386 (470.57.02-2) ...
Paramétrage de libnvidia-cbl:amd64 (470.57.02-2) ...
Paramétrage de nvidia-egl-common (470.57.02-2) ...
Paramétrage de nvidia-kernel-common (20151021+13) ...
Paramétrage de linux-headers-amd64 (5.14.6-2) ...
Paramétrage de update-glx (1.2.0) ...
Paramétrage de libopengl0:amd64 (1.3.4-2+b1) ...
Paramétrage de libopengl0:i386 (1.3.4-2+b1) ...
Paramétrage de nvidia-modprobe (470.57.02-1) ...
Paramétrage de libegl-mesa0:i386 (20.3.5-1) ...
Paramétrage de libgles2:i386 (1.3.4-2+b1) ...
Paramétrage de libgles1:amd64 (1.3.4-2+b1) ...
Paramétrage de libgles1:i386 (1.3.4-2+b1) ...
Paramétrage de libnvidia-glcore:amd64 (470.57.02-2) ...
Paramétrage de libnvidia-ptxjitcompiler1:amd64 (470.57.02-2) ...
Paramétrage de libnvidia-ptxjitcompiler1:i386 (470.57.02-2) ...
Paramétrage de nvidia-vulkan-common (470.57.02-2) ...
Paramétrage de libegl1:i386 (1.3.4-2+b1) ...
Paramétrage de dctrl-tools (2.24-3+b1) ...
Paramétrage de libnvidia-rtcore:amd64 (470.57.02-2) ...
Paramétrage de glx-alternative-mesa (1.2.0) ...
Paramétrage de dkms (2.8.4-4) ...
Paramétrage de glx-diversions (1.2.0) ...
Traitement des actions différées (« triggers ») pour mailcap (3.70) ...
Traitement des actions différées (« triggers ») pour desktop-file-utils (0.26-1) ...
Traitement des actions différées (« triggers ») pour initramfs-tools (0.140) ...
update-initramfs: Generating /boot/initrd.img-5.14.0-1-amd64
Traitement des actions différées (« triggers ») pour hicolor-icon-theme (0.17-2) ...
Traitement des actions différées (« triggers ») pour gnome-menus (3.36.0-1) ...
Traitement des actions différées (« triggers ») pour libc-bin (2.32-4) ...
Traitement des actions différées (« triggers ») pour man-db (2.9.4-2) ...
Traitement des actions différées (« triggers ») pour glx-alternative-mesa (1.2.0) ...
update-alternatives: utilisation de « /usr/lib/mesa-diverted » pour fournir « /usr/lib/glx » (glx) en mode automatique
Paramétrage de glx-alternative-nvidia (1.2.0) ...
Traitement des actions différées (« triggers ») pour glx-alternative-nvidia (1.2.0) ...
Paramétrage de nvidia-alternative (470.57.02-2) ...
Traitement des actions différées (« triggers ») pour nvidia-alternative (470.57.02-2) ...
update-alternatives: utilisation de « /usr/lib/nvidia/current » pour fournir « /usr/lib/nvidia/nvidia » (nvidia) en mode automatique
Paramétrage de libnvidia-ml1:amd64 (470.57.02-2) ...
Paramétrage de libcuda1:amd64 (470.57.02-2) ...
Paramétrage de libcuda1:i386 (470.57.02-2) ...
Paramétrage de libnvidia-cfg1:amd64 (470.57.02-2) ...
Paramétrage de libglx-nvidia0:amd64 (470.57.02-2) ...
Paramétrage de libglx-nvidia0:i386 (470.57.02-2) ...
Paramétrage de nvidia-kernel-support (470.57.02-2) ...
Paramétrage de xserver-xorg-video-nvidia (470.57.02-2) ...
Paramétrage de nvidia-vulkan-icd:amd64 (470.57.02-2) ...
Paramétrage de nvidia-vulkan-icd:i386 (470.57.02-2) ...
Paramétrage de nvidia-vdpau-driver:amd64 (470.57.02-2) ...
Paramétrage de libgl1-nvidia-glvnd-glx:amd64 (470.57.02-2) ...
Paramétrage de libgl1-nvidia-glvnd-glx:i386 (470.57.02-2) ...
Paramétrage de libgles-nvidia1:amd64 (470.57.02-2) ...
Paramétrage de libgles-nvidia1:i386 (470.57.02-2) ...
Paramétrage de libegl-nvidia0:amd64 (470.57.02-2) ...
Paramétrage de libegl-nvidia0:i386 (470.57.02-2) ...
Paramétrage de nvidia-settings (470.57.02-2) ...
Paramétrage de nvidia-smi (470.57.02-2) ...
Paramétrage de libgles-nvidia2:amd64 (470.57.02-2) ...
Paramétrage de libgles-nvidia2:i386 (470.57.02-2) ...
Paramétrage de nvidia-driver-bin (470.57.02-2) ...
Paramétrage de libnvcuvid1:amd64 (470.57.02-2) ...
Paramétrage de libnvcuvid1:i386 (470.57.02-2) ...
Paramétrage de nvidia-persistenced (470.57.02-1) ...
Created symlink /etc/systemd/system/multi-user.target.wants/nvidia-persistenced.service → /lib/systemd/system/nvidia-persistenced.service.
Job for nvidia-persistenced.service failed because the control process exited with error code.
See "systemctl status nvidia-persistenced.service" and "journalctl -xe" for details.
Paramétrage de nvidia-egl-icd:amd64 (470.57.02-2) ...
Paramétrage de nvidia-egl-icd:i386 (470.57.02-2) ...
Paramétrage de libnvidia-encode1:amd64 (470.57.02-2) ...
Paramétrage de libnvidia-encode1:i386 (470.57.02-2) ...
Paramétrage de nvidia-driver-libs:amd64 (470.57.02-2) ...
Paramétrage de nvidia-driver-libs:i386 (470.57.02-2) ...
Traitement des actions différées (« triggers ») pour nvidia-alternative (470.57.02-2) ...
update-alternatives: mise à jour de l'alternative /usr/lib/nvidia/current car le groupe de liens nvidia contient des liens esclaves modifiés
Paramétrage de nvidia-kernel-dkms (470.57.02-2) ...
Loading new nvidia-current-470.57.02 DKMS files...
Building for 5.14.0-1-amd64
Building initial module for 5.14.0-1-amd64
Error! Bad return status for module build on kernel: 5.14.0-1-amd64 (x86_64)
Consult /var/lib/dkms/nvidia-current/470.57.02/build/make.log for more information.
dpkg: erreur de traitement du paquet nvidia-kernel-dkms (--configure) :
 installed nvidia-kernel-dkms package post-installation script subprocess returned error exit status 10
dpkg: des problèmes de dépendances empêchent la configuration de nvidia-driver :
 nvidia-driver dépend de nvidia-kernel-dkms (= 470.57.02-2) | nvidia-kernel-470.57.02 ; cependant :
 Le paquet nvidia-kernel-dkms n'est pas encore configuré.
  Le paquet nvidia-kernel-470.57.02 n'est pas installé.
  Le paquet nvidia-kernel-dkms qui fournit nvidia-kernel-470.57.02 n'est pas encore configuré.

dpkg: erreur de traitement du paquet nvidia-driver (--configure) :
 problèmes de dépendances - laissé non configuré
Traitement des actions différées (« triggers ») pour libc-bin (2.32-4) ...
Traitement des actions différées (« triggers ») pour initramfs-tools (0.140) ...
update-initramfs: Generating /boot/initrd.img-5.14.0-1-amd64
Traitement des actions différées (« triggers ») pour update-glx (1.2.0) ...
Traitement des actions différées (« triggers ») pour glx-alternative-nvidia (1.2.0) ...
update-alternatives: utilisation de « /usr/lib/nvidia » pour fournir « /usr/lib/glx » (glx) en mode automatique
Traitement des actions différées (« triggers ») pour glx-alternative-mesa (1.2.0) ...
Traitement des actions différées (« triggers ») pour libc-bin (2.32-4) ...
Traitement des actions différées (« triggers ») pour initramfs-tools (0.140) ...
update-initramfs: Generating /boot/initrd.img-5.14.0-1-amd64
Des erreurs ont été rencontrées pendant l'exécution :
 nvidia-kernel-dkms
 nvidia-driver
E: Sub-process /usr/bin/dpkg returned an error code (1)
Paramétrage de nvidia-kernel-dkms (470.57.02-2) ...
Removing old nvidia-current-470.57.02 DKMS files...

------------------------------
Deleting module version: 470.57.02
completely from the DKMS tree.
------------------------------
Done.
Loading new nvidia-current-470.57.02 DKMS files...
Building for 5.14.0-1-amd64
Building initial module for 5.14.0-1-amd64
Error! Bad return status for module build on kernel: 5.14.0-1-amd64 (x86_64)
Consult /var/lib/dkms/nvidia-current/470.57.02/build/make.log for more information.
dpkg: erreur de traitement du paquet nvidia-kernel-dkms (--configure) :
 installed nvidia-kernel-dkms package post-installation script subprocess returned error exit status 10
dpkg: des problèmes de dépendances empêchent la configuration de nvidia-driver :
 nvidia-driver dépend de nvidia-kernel-dkms (= 470.57.02-2) | nvidia-kernel-470.57.02 ; cependant :
 Le paquet nvidia-kernel-dkms n'est pas encore configuré.
  Le paquet nvidia-kernel-470.57.02 n'est pas installé.
  Le paquet nvidia-kernel-dkms qui fournit nvidia-kernel-470.57.02 n'est pas encore configuré.

dpkg: erreur de traitement du paquet nvidia-driver (--configure) :
 problèmes de dépendances - laissé non configuré
Des erreurs ont été rencontrées pendant l'exécution :
 nvidia-kernel-dkms
 nvidia-driver
                                 




conformément a ce qui est indiqué je regarde le fichier log

gedit /var/lib/dkms/nvidia-current/470.57.02/build/make.log


DKMS make.log for nvidia-current-470.57.02 for kernel 5.14.0-1-amd64 (x86_64)
mar. 28 sept. 2021 19:17:42 CEST
make KBUILD_OUTPUT=/lib/modules/5.14.0-1-amd64/build V=1 -C /lib/modules/5.14.0-1-amd64/source M=/var/lib/dkms/nvidia-current/470.57.02/build ARCH=x86_64 NV_KERNEL_SOURCES=/lib/modules/5.14.0-1-amd64/source NV_KERNEL_OUTPUT=/lib/modules/5.14.0-1-amd64/build NV_KERNEL_MODULES="nvidia nvidia-uvm nvidia-modeset nvidia-drm nvidia-peermem" INSTALL_MOD_DIR=kernel/drivers/video NV_SPECTRE_V2=0 modules
make[1] : on entre dans le répertoire « /usr/src/linux-headers-5.14.0-1-common »
make -C /usr/src/linux-headers-5.14.0-1-amd64 -f /usr/src/linux-headers-5.14.0-1-common/Makefile modules
make[2] : on entre dans le répertoire « /usr/src/linux-headers-5.14.0-1-amd64 »
test -e include/generated/autoconf.h -a -e include/config/auto.conf || (    \
echo >&2;             \
echo >&2 "  ERROR: Kernel configuration is invalid.";   \
echo >&2 "         include/generated/autoconf.h or include/config/auto.conf are missing.";\
echo >&2 "         Run 'make oldconfig && make prepare' on kernel src to fix it.";  \
echo >&2 ;              \
/bin/false)
make -f /usr/src/linux-headers-5.14.0-1-common/scripts/Makefile.build obj=/var/lib/dkms/nvidia-current/470.57.02/build \
single-build= \
need-builtin=1 need-modorder=1
NV_CONFTEST_CMD=/bin/sh /var/lib/dkms/nvidia-current/470.57.02/build/conftest.sh " gcc-10" x86_64 /lib/modules/5.14.0-1-amd64/source /lib/modules/5.14.0-1-amd64/build
NV_CONFTEST_CFLAGS=-O2 -D__KERNEL__ -DKBUILD_BASENAME="#conftest30030" -DKBUILD_MODNAME="#conftest30030" -nostdinc -isystem /usr/lib/gcc/x86_64-linux-gnu/10/include -I/lib/modules/5.14.0-1-amd64/source/arch/x86/include/asm/mach-default -I/lib/modules/5.14.0-1-amd64/source/include/asm-x86/mach-default -I/lib/modules/5.14.0-1-amd64/build/include2 -I/lib/modules/5.14.0-1-amd64/build/include -include /lib/modules/5.14.0-1-amd64/build/include/generated/autoconf.h -I/lib/modules/5.14.0-1-amd64/source/arch/x86/include -I/lib/modules/5.14.0-1-amd64/source/arch/x86/include/uapi -I/lib/modules/5.14.0-1-amd64/build/arch/x86/include/generated -I/lib/modules/5.14.0-1-amd64/build/arch/x86/include/generated/uapi -I/lib/modules/5.14.0-1-amd64/source/include -I/lib/modules/5.14.0-1-amd64/source/include/uapi -I/lib/modules/5.14.0-1-amd64/source/include/xen -I/lib/modules/5.14.0-1-amd64/build/include/generated/uapi -mfentry -DCC_USING_FENTRY -I/var/lib/dkms/nvidia-current/470.57.02/build/common/inc -I/var/lib/dkms/nvidia-current/470.57.02/build -Wall -MD   -Wno-cast-qual -Wno-error -Wno-format-extra-args -D__KERNEL__ -DMODULE -DNVRM -DNV_VERSION_STRING=\"470.57.02\" -Wno-unused-function -Wuninitialized -fno-strict-aliasing -mno-red-zone -mcmodel=kernel -DNV_UVM_ENABLE -Werror=undef -DNV_SPECTRE_V2=0 -DNV_KERNEL_INTERFACE_LAYER -fno-pie -Wall -Wundef -Wno-trigraphs -fno-strict-aliasing -fno-common -fshort-wchar -fno-PIE -Wno-format-security -std=gnu89 -mno-sse -mno-mmx -mno-sse2 -mno-3dnow -mno-avx -fcf-protection=none -m64 -falign-jumps=1 -falign-loops=1 -mno-80387 -mno-fp-ret-in-387 -mpreferred-stack-boundary=3 -mskip-rax-setup -mtune=generic -mno-red-zone -mcmodel=kernel -DCONFIG_X86_X32_ABI -Wno-sign-compare -fno-asynchronous-unwind-tables -mindirect-branch=thunk-extern -mindirect-branch-register -fno-jump-tables -fno-delete-null-pointer-checks -Wno-frame-address -Wno-format-truncation -Wno-format-overflow -Wno-address-of-packed-member -O2 -fno-allow-store-data-races -Wframe-larger-than=2048 -fstack-protector-strong -Wimplicit-fallthrough=5 -Wno-main -Wno-unused-but-set-variable -Wno-unused-const-variable -fno-stack-clash-protection -g -pg -mrecord-mcount -mfentry -DCC_USING_FENTRY -Wdeclaration-after-statement -Wvla -Wno-pointer-sign -Wno-stringop-truncation -Wno-zero-length-bounds -Wno-array-bounds -Wno-stringop-overflow -Wno-restrict -Wno-maybe-uninitialized -fno-strict-overflow -fno-stack-check -fconserve-stack -Wno-packed-not-aligned
KBUILD_CFLAGS=-Wall -Wundef -Werror=strict-prototypes -Wno-trigraphs -fno-strict-aliasing -fno-common -fshort-wchar -fno-PIE -Werror=implicit-function-declaration -Werror=implicit-int -Werror=return-type -Wno-format-security -std=gnu89 -mno-sse -mno-mmx -mno-sse2 -mno-3dnow -mno-avx -fcf-protection=none -m64 -falign-jumps=1 -falign-loops=1 -mno-80387 -mno-fp-ret-in-387 -mpreferred-stack-boundary=3 -mskip-rax-setup -mtune=generic -mno-red-zone -mcmodel=kernel -DCONFIG_X86_X32_ABI -Wno-sign-compare -fno-asynchronous-unwind-tables -mindirect-branch=thunk-extern -mindirect-branch-register -fno-jump-tables -fno-delete-null-pointer-checks -Wno-frame-address -Wno-format-truncation -Wno-format-overflow -Wno-address-of-packed-member -O2 -fno-allow-store-data-races -Wframe-larger-than=2048 -fstack-protector-strong -Wimplicit-fallthrough=5 -Wno-main -Wno-unused-but-set-variable -Wno-unused-const-variable  -fno-stack-clash-protection -g -pg -mrecord-mcount -mfentry -DCC_USING_FENTRY -Wdeclaration-after-statement -Wvla -Wno-pointer-sign -Wno-stringop-truncation -Wno-zero-length-bounds -Wno-array-bounds -Wno-stringop-overflow -Wno-restrict -Wno-maybe-uninitialized -fno-strict-overflow -fno-stack-check -fconserve-stack -Werror=date-time -Werror=incompatible-pointer-types -Werror=designated-init -Wno-packed-not-aligned
LINUXINCLUDE=-I/usr/src/linux-headers-5.14.0-1-common/arch/x86/include -I./arch/x86/include/generated -I/usr/src/linux-headers-5.14.0-1-common/include -I./include -I/usr/src/linux-headers-5.14.0-1-common/arch/x86/include/uapi -I./arch/x86/include/generated/uapi -I/usr/src/linux-headers-5.14.0-1-common/include/uapi -I./include/generated/uapi -include /usr/src/linux-headers-5.14.0-1-common/include/linux/compiler-version.h -include /usr/src/linux-headers-5.14.0-1-common/include/linux/kconfig.h
LDFLAGS=
KBUILD_LDFLAGS=-m elf_x86_64
ARCH=x86_64
  ln -sf /var/lib/dkms/nvidia-current/470.57.02/build/nvidia/nv-kernel-amd64.o_binary /var/lib/dkms/nvidia-current/470.57.02/build/nvidia/nv-kernel.o
  ln -sf /var/lib/dkms/nvidia-current/470.57.02/build/nvidia-modeset/nv-modeset-kernel-amd64.o_binary /var/lib/dkms/nvidia-current/470.57.02/build/nvidia-modeset/nv-modeset-kernel.o
 CONFTEST macros.h:
 CONFTEST patches.h:
static struct {
                const char *short_description;
                const char *description;
              } __nv_patches[] = {
{ NULL, NULL } };
 CONFTEST headers.h:
#undef NV_ASM_SYSTEM_H_PRESENT
#undef NV_DRM_DRMP_H_PRESENT
#define NV_DRM_DRM_AUTH_H_PRESENT
#define NV_DRM_DRM_GEM_H_PRESENT
#define NV_DRM_DRM_CRTC_H_PRESENT
#define NV_DRM_DRM_ATOMIC_H_PRESENT
#define NV_DRM_DRM_ATOMIC_HELPER_H_PRESENT
#define NV_DRM_DRM_ENCODER_H_PRESENT
#define NV_DRM_DRM_ATOMIC_UAPI_H_PRESENT
#define NV_DRM_DRM_DRV_H_PRESENT
#define NV_DRM_DRM_FRAMEBUFFER_H_PRESENT
#define NV_DRM_DRM_CONNECTOR_H_PRESENT
#define NV_DRM_DRM_PROBE_HELPER_H_PRESENT
#define NV_DRM_DRM_BLEND_H_PRESENT
#define NV_DRM_DRM_FOURCC_H_PRESENT
#define NV_DRM_DRM_PRIME_H_PRESENT
#define NV_DRM_DRM_PLANE_H_PRESENT
#define NV_DRM_DRM_VBLANK_H_PRESENT
#define NV_DRM_DRM_FILE_H_PRESENT
#define NV_DRM_DRM_IOCTL_H_PRESENT
#define NV_DRM_DRM_DEVICE_H_PRESENT
#undef NV_DT_BINDINGS_INTERCONNECT_TEGRA_ICC_ID_H_PRESENT
#define NV_GENERATED_AUTOCONF_H_PRESENT
#define NV_GENERATED_COMPILE_H_PRESENT
#define NV_GENERATED_UTSRELEASE_H_PRESENT
#define NV_LINUX_EFI_H_PRESENT
#define NV_LINUX_KCONFIG_H_PRESENT
#undef NV_LINUX_PLATFORM_TEGRA_MC_UTILS_H_PRESENT
#define NV_LINUX_SEMAPHORE_H_PRESENT
#define NV_LINUX_PRINTK_H_PRESENT
#define NV_LINUX_RATELIMIT_H_PRESENT
#undef NV_LINUX_PRIO_TREE_H_PRESENT
#define NV_LINUX_LOG2_H_PRESENT
#define NV_LINUX_OF_H_PRESENT
#define NV_LINUX_BUG_H_PRESENT
#define NV_LINUX_SCHED_SIGNAL_H_PRESENT
#define NV_LINUX_SCHED_TASK_H_PRESENT
#define NV_LINUX_SCHED_TASK_STACK_H_PRESENT
#undef NV_XEN_IOEMU_H_PRESENT
#undef NV_LINUX_FENCE_H_PRESENT
#define NV_LINUX_DMA_RESV_H_PRESENT
#undef NV_SOC_TEGRA_CHIP_ID_H_PRESENT
#define NV_SOC_TEGRA_FUSE_H_PRESENT
#undef NV_SOC_TEGRA_TEGRA_BPMP_H_PRESENT
#undef NV_VIDEO_NV_INTERNAL_H_PRESENT
#undef NV_LINUX_PLATFORM_TEGRA_DCE_DCE_CLIENT_IPC_H_PRESENT
#undef NV_LINUX_NVHOST_H_PRESENT
#undef NV_LINUX_NVHOST_T194_H_PRESENT
#undef NV_ASM_BOOK3S_64_HASH_64K_H_PRESENT
#define NV_ASM_SET_MEMORY_H_PRESENT
#define NV_ASM_PROM_H_PRESENT
#undef NV_ASM_POWERNV_H_PRESENT
#define NV_LINUX_ATOMIC_H_PRESENT
#define NV_ASM_BARRIER_H_PRESENT
#undef NV_ASM_OPAL_API_H_PRESENT
#define NV_SOUND_HDAUDIO_H_PRESENT
#define NV_ASM_PGTABLE_TYPES_H_PRESENT
#define NV_LINUX_STRINGHASH_H_PRESENT
#define NV_LINUX_DMA_MAP_OPS_H_PRESENT
#undef NV_RDMA_PEER_MEM_H_PRESENT
#define NV_SOUND_HDA_CODEC_H_PRESENT
#define NV_LINUX_DMA_BUF_H_PRESENT
#define NV_LINUX_TIME_H_PRESENT
 CONFTEST: hash__remap_4k_pfn
 CONFTEST: set_pages_uc
 CONFTEST: list_is_first
 CONFTEST: set_memory_uc
 CONFTEST: set_memory_array_uc
 CONFTEST: set_pages_array_uc
 CONFTEST: acquire_console_sem
 CONFTEST: console_lock
 CONFTEST: ioremap_cache
 CONFTEST: ioremap_wc
 CONFTEST: acpi_walk_namespace
 CONFTEST: sg_alloc_table
 CONFTEST: pci_get_domain_bus_and_slot
 CONFTEST: get_num_physpages
 CONFTEST: efi_enabled
 CONFTEST: pde_data
 CONFTEST: proc_remove
 CONFTEST: pm_vt_switch_required
 CONFTEST: xen_ioemu_inject_msi
 CONFTEST: phys_to_dma
 CONFTEST: get_dma_ops
 CONFTEST: dma_attr_macros
 CONFTEST: dma_map_page_attrs
 CONFTEST: write_cr4
 CONFTEST: of_get_property
 CONFTEST: of_find_node_by_phandle
 CONFTEST: of_node_to_nid
 CONFTEST: pnv_pci_get_npu_dev
 CONFTEST: node_end_pfn
 CONFTEST: of_get_ibm_chip_id
 CONFTEST: pci_bus_address
 CONFTEST: pci_stop_and_remove_bus_device
 CONFTEST: pci_remove_bus_device
 CONFTEST: register_cpu_notifier
 CONFTEST: cpuhp_setup_state
 CONFTEST: dma_map_resource
 CONFTEST: backlight_device_register
 CONFTEST: get_backlight_device_by_name
 CONFTEST: timer_setup
 CONFTEST: pci_enable_msix_range
 CONFTEST: kernel_read_has_pointer_pos_arg
 CONFTEST: kernel_write
 CONFTEST: kthread_create_on_node
 CONFTEST: of_find_matching_node
 CONFTEST: dev_is_pci
 CONFTEST: dma_direct_map_resource
 CONFTEST: tegra_get_platform
 CONFTEST: tegra_bpmp_send_receive
 CONFTEST: flush_cache_all
 CONFTEST: vmf_insert_pfn
 CONFTEST: jiffies_to_timespec
 CONFTEST: ktime_get_raw_ts64
 CONFTEST: ktime_get_real_ts64
 CONFTEST: full_name_hash
 CONFTEST: hlist_for_each_entry
 CONFTEST: pci_enable_atomic_ops_to_root
 CONFTEST: vga_tryget
 CONFTEST: pgprot_decrypted
 CONFTEST: iterate_fd
 CONFTEST: seq_read_iter
 CONFTEST: sg_page_iter_page
 CONFTEST: unsafe_follow_pfn
 CONFTEST: drm_gem_object_get
 CONFTEST: drm_gem_object_put_unlocked
 CONFTEST: set_close_on_exec
 CONFTEST: address_space_init_once
 CONFTEST: kbasename
 CONFTEST: vzalloc
 CONFTEST: wait_on_bit_lock_argument_count
 CONFTEST: bitmap_clear
 CONFTEST: usleep_range
 CONFTEST: radix_tree_empty
 CONFTEST: radix_tree_replace_slot
 CONFTEST: pnv_npu2_init_context
 CONFTEST: cpumask_of_node
 CONFTEST: drm_dev_unref
 CONFTEST: drm_reinit_primary_mode_group
 CONFTEST: get_user_pages_remote
 CONFTEST: get_user_pages
 CONFTEST: drm_gem_object_lookup
 CONFTEST: drm_atomic_state_ref_counting
 CONFTEST: drm_driver_has_gem_prime_res_obj
 CONFTEST: drm_atomic_helper_connector_dpms
 CONFTEST: drm_connector_funcs_have_mode_in_name
 CONFTEST: drm_framebuffer_get
 CONFTEST: drm_dev_put
 CONFTEST: drm_format_num_planes
 CONFTEST: drm_connector_for_each_possible_encoder
 CONFTEST: drm_rotation_available
 CONFTEST: drm_vma_offset_exact_lookup_locked
 CONFTEST: is_export_symbol_gpl_of_node_to_nid
 CONFTEST: is_export_symbol_gpl_sme_active
 CONFTEST: is_export_symbol_present_swiotlb_map_sg_attrs
 CONFTEST: is_export_symbol_present_swiotlb_dma_ops
 CONFTEST: is_export_symbol_present_close_fd
 CONFTEST: is_export_symbol_present___close_fd
 CONFTEST: is_export_symbol_present_get_unused_fd
 CONFTEST: is_export_symbol_present_get_unused_fd_flags
 CONFTEST: is_export_symbol_present_nvhost_get_default_device
 CONFTEST: is_export_symbol_present_nvhost_syncpt_unit_interface_get_byte_offset
 CONFTEST: is_export_symbol_present_nvhost_syncpt_unit_interface_get_aperture
 CONFTEST: is_export_symbol_present_tegra_dce_register_ipc_client
 CONFTEST: is_export_symbol_present_tegra_dce_unregister_ipc_client
 CONFTEST: is_export_symbol_present_tegra_dce_client_ipc_send_recv
 CONFTEST: is_export_symbol_present_dram_clk_to_mc_clk
 CONFTEST: is_export_symbol_present_get_dram_num_channels
 CONFTEST: is_export_symbol_present_tegra_dram_types
 CONFTEST: is_export_symbol_present_kthread_create_on_node
 CONFTEST: acpi_op_remove
 CONFTEST: file_operations
 CONFTEST: file_inode
 CONFTEST: kuid_t
 CONFTEST: dma_ops
 CONFTEST: swiotlb_dma_ops
 CONFTEST: noncoherent_swiotlb_dma_ops
 CONFTEST: vm_fault_has_address
 CONFTEST: backlight_properties_type
 CONFTEST: vm_insert_pfn_prot
 CONFTEST: vmf_insert_pfn_prot
 CONFTEST: vm_ops_fault_removed_vma_arg
 CONFTEST: vmbus_channel_has_ringbuffer_page
 CONFTEST: device_driver_of_match_table
 CONFTEST: device_of_node
 CONFTEST: node_states_n_memory
 CONFTEST: kmem_cache_has_kobj_remove_work
 CONFTEST: sysfs_slab_unlink
 CONFTEST: proc_ops
 CONFTEST: timespec64
 CONFTEST: vmalloc_has_pgprot_t_arg
 CONFTEST: acpi_fadt_low_power_s0
 CONFTEST: mm_has_mmap_lock
 CONFTEST: pci_channel_state
 CONFTEST: address_space
 CONFTEST: backing_dev_info
 CONFTEST: mm_context_t
 CONFTEST: vm_fault_t
 CONFTEST: mmu_notifier_ops_invalidate_range
 CONFTEST: drm_bus_present
 CONFTEST: drm_bus_has_bus_type
 CONFTEST: drm_bus_has_get_irq
 CONFTEST: drm_bus_has_get_name
 CONFTEST: drm_driver_has_device_list
 CONFTEST: drm_driver_has_legacy_dev_list
 CONFTEST: drm_driver_has_set_busid
 CONFTEST: drm_crtc_state_has_connectors_changed
 CONFTEST: drm_init_function_args
 CONFTEST: drm_helper_mode_fill_fb_struct
 CONFTEST: drm_master_drop_has_from_release_arg
 CONFTEST: drm_driver_unload_has_int_return_type
 CONFTEST: drm_atomic_helper_crtc_destroy_state_has_crtc_arg
 CONFTEST: drm_atomic_helper_plane_destroy_state_has_plane_arg
 CONFTEST: drm_mode_object_find_has_file_priv_arg
 CONFTEST: dma_buf_owner
 CONFTEST: drm_connector_list_iter
 CONFTEST: drm_atomic_helper_swap_state_has_stall_arg
 CONFTEST: drm_driver_prime_flag_present
 CONFTEST: drm_gem_object_has_resv
 CONFTEST: drm_crtc_state_has_async_flip
 CONFTEST: drm_crtc_state_has_pageflip_flags
 CONFTEST: drm_format_modifiers_present
 CONFTEST: drm_vma_node_is_allowed_has_tag_arg
 CONFTEST: drm_vma_offset_node_has_readonly
 CONFTEST: drm_display_mode_has_vrefresh
 CONFTEST: drm_driver_master_set_has_int_return_type
 CONFTEST: drm_driver_has_gem_free_object
 CONFTEST: drm_prime_pages_to_sg_has_drm_device_arg
 CONFTEST: drm_driver_has_gem_prime_callbacks
 CONFTEST: drm_crtc_atomic_check_has_atomic_state_arg
 CONFTEST: drm_gem_object_vmap_has_map_arg
 CONFTEST: drm_plane_atomic_check_has_atomic_state_arg
 CONFTEST: dom0_kernel_present
 CONFTEST: nvidia_vgpu_kvm_build
 CONFTEST: nvidia_grid_build
 CONFTEST: nvidia_grid_csp_build
 CONFTEST: pm_runtime_available
 CONFTEST: pci_class_multimedia_hd_audio
 CONFTEST: drm_available
 CONFTEST: drm_atomic_available
 CONFTEST: is_export_symbol_gpl_refcount_inc
 CONFTEST: is_export_symbol_gpl_refcount_dec_and_test
 CONFTEST: drm_alpha_blending_available
 CONFTEST: ib_peer_memory_symbols
 CONFTEST functions.h:
 CONFTEST symbols.h:
#undef NV_HASH__REMAP_4K_PFN_PRESENT
#define NV_SET_PAGES_UC_PRESENT
#define NV_LIST_IS_FIRST_PRESENT
#define NV_SET_MEMORY_UC_PRESENT
#undef NV_SET_MEMORY_ARRAY_UC_PRESENT
#define NV_SET_PAGES_ARRAY_UC_PRESENT
#undef NV_ACQUIRE_CONSOLE_SEM_PRESENT
#define NV_CONSOLE_LOCK_PRESENT
#define NV_IOREMAP_CACHE_PRESENT
#define NV_IOREMAP_WC_PRESENT
#define NV_ACPI_WALK_NAMESPACE_PRESENT
#define NV_ACPI_WALK_NAMESPACE_ARGUMENT_COUNT 7
#define NV_SG_ALLOC_TABLE_FROM_PAGES_PRESENT
#define NV_PCI_GET_DOMAIN_BUS_AND_SLOT_PRESENT
#define NV_GET_NUM_PHYSPAGES_PRESENT
#define NV_EFI_ENABLED_PRESENT
#define NV_EFI_ENABLED_ARGUMENT_COUNT 1
#define NV_PDE_DATA_PRESENT
#define NV_PROC_REMOVE_PRESENT
#define NV_PM_VT_SWITCH_REQUIRED_PRESENT
#undef NV_XEN_IOEMU_INJECT_MSI
#undef NV_PHYS_TO_DMA_PRESENT
#define NV_GET_DMA_OPS_PRESENT
#define NV_DMA_ATTR_SKIP_CPU_SYNC_PRESENT
#define NV_DMA_MAP_PAGE_ATTRS_PRESENT
#undef NV_WRITE_CR4_PRESENT
#define NV_LINUX_OF_H_USABLE
#define NV_OF_GET_PROPERTY_PRESENT
#define NV_LINUX_OF_H_USABLE
#define NV_OF_FIND_NODE_BY_PHANDLE_PRESENT
#define NV_LINUX_OF_H_USABLE
#define NV_OF_NODE_TO_NID_PRESENT
#undef NV_PNV_PCI_GET_NPU_DEV_PRESENT
#undef NV_OF_GET_IBM_CHIP_ID_PRESENT
#define NV_NODE_END_PFN_PRESENT
#define NV_PCI_BUS_ADDRESS_PRESENT
#define NV_PCI_STOP_AND_REMOVE_BUS_DEVICE_PRESENT
#undef NV_PCI_REMOVE_BUS_DEVICE_PRESENT
#undef NV_REGISTER_CPU_NOTIFIER_PRESENT
#define NV_CPUHP_SETUP_STATE_PRESENT
#define NV_DMA_MAP_RESOURCE_PRESENT
#define NV_BACKLIGHT_DEVICE_REGISTER_PRESENT
#undef NV_GET_BACKLIGHT_DEVICE_BY_NAME_PRESENT
#define NV_TIMER_SETUP_PRESENT
#define NV_PCI_ENABLE_MSIX_RANGE_PRESENT
#define NV_KERNEL_READ_HAS_POINTER_POS_ARG
#define NV_KERNEL_WRITE_PRESENT
#define NV_KERNEL_WRITE_HAS_POINTER_POS_ARG
#define NV_KTHREAD_CREATE_ON_NODE_PRESENT
#define NV_LINUX_OF_H_USABLE
#define NV_OF_FIND_MATCHING_NODE_PRESENT
#define NV_DEV_IS_PCI_PRESENT
#undef NV_DMA_IS_DIRECT_PRESENT
#define NV_TEGRA_GET_PLATFORM_PRESENT
#undef NV_TEGRA_BPMP_SEND_RECEIVE
#define NV_FLUSH_CACHE_ALL_PRESENT
#define NV_VMF_INSERT_PFN_PRESENT
#undef NV_JIFFIES_TO_TIMESPEC_PRESENT
#define NV_KTIME_GET_RAW_TS64_PRESENT
#define NV_KTIME_GET_REAL_TS64_PRESENT
#define NV_FULL_NAME_HASH_ARGUMENT_COUNT 3
#define NV_HLIST_FOR_EACH_ENTRY_ARGUMENT_COUNT 3
#define NV_PCI_ENABLE_ATOMIC_OPS_TO_ROOT_PRESENT
#undef NV_VGA_TRYGET_PRESENT
#define NV_PGPROT_DECRYPTED_PRESENT
#define NV_ITERATE_FD_PRESENT
#define NV_SEQ_READ_ITER_PRESENT
#define NV_SG_PAGE_ITER_PAGE_PRESENT
#undef NV_UNSAFE_FOLLOW_PFN_PRESENT
#define NV_DRM_GEM_OBJECT_GET_PRESENT
#undef NV_DRM_GEM_OBJECT_PUT_UNLOCK_PRESENT
#undef NV_SET_CLOSE_ON_EXEC_PRESENT
#define NV_ADDRESS_SPACE_INIT_ONCE_PRESENT
#define NV_KBASENAME_PRESENT
#define NV_VZALLOC_PRESENT
#define NV_WAIT_ON_BIT_LOCK_ARGUMENT_COUNT 3
#define NV_BITMAP_CLEAR_PRESENT
#define NV_USLEEP_RANGE_PRESENT
#define NV_RADIX_TREE_EMPTY_PRESENT
#define NV_RADIX_TREE_REPLACE_SLOT_PRESENT
#define NV_RADIX_TREE_REPLACE_SLOT_ARGUMENT_COUNT 3
#undef NV_PNV_NPU2_INIT_CONTEXT_PRESENT
#undef NV_PNV_NPU2_INIT_CONTEXT_CALLBACK_RETURNS_VOID
#define NV_CPUMASK_OF_NODE_PRESENT
#undef NV_DRM_DEV_UNREF_PRESENT
#undef NV_DRM_REINIT_PRIMARY_MODE_GROUP_PRESENT
#define NV_GET_USER_PAGES_REMOTE_PRESENT
#undef NV_GET_USER_PAGES_REMOTE_HAS_WRITE_AND_FORCE_ARGS
#undef NV_GET_USER_PAGES_REMOTE_HAS_TSK_ARG
#define NV_GET_USER_PAGES_REMOTE_HAS_LOCKED_ARG
#undef NV_GET_USER_PAGES_HAS_WRITE_AND_FORCE_ARGS
#undef NV_GET_USER_PAGES_HAS_TASK_STRUCT
#define NV_DRM_GEM_OBJECT_LOOKUP_ARGUMENT_COUNT 2
#define NV_DRM_ATOMIC_STATE_REF_COUNTING_PRESENT
#undef NV_DRM_DRIVER_HAS_GEM_PRIME_RES_OBJ
#undef NV_DRM_ATOMIC_HELPER_CONNECTOR_DPMS_PRESENT
#undef NV_DRM_CONNECTOR_FUNCS_HAVE_MODE_IN_NAME
#define NV_DRM_FRAMEBUFFER_GET_PRESENT
#define NV_DRM_DEV_PUT_PRESENT
#undef NV_DRM_FORMAT_NUM_PLANES_PRESENT
#define NV_DRM_CONNECTOR_FOR_EACH_POSSIBLE_ENCODER_ARGUMENT_COUNT 2
#define NV_DRM_ROTATION_AVAILABLE
#define NV_DRM_VMA_OFFSET_EXACT_LOOKUP_LOCKED_PRESENT
#define NV_IS_EXPORT_SYMBOL_GPL_of_node_to_nid 0
#define NV_IS_EXPORT_SYMBOL_GPL_sme_active 0
#define NV_IS_EXPORT_SYMBOL_PRESENT_swiotlb_map_sg_attrs 0
#define NV_IS_EXPORT_SYMBOL_PRESENT_swiotlb_dma_ops 0
#define NV_IS_EXPORT_SYMBOL_PRESENT___close_fd 0
#define NV_IS_EXPORT_SYMBOL_PRESENT_close_fd 1
#define NV_IS_EXPORT_SYMBOL_PRESENT_get_unused_fd 0
#define NV_IS_EXPORT_SYMBOL_PRESENT_get_unused_fd_flags 1
#define NV_IS_EXPORT_SYMBOL_PRESENT_nvhost_get_default_device 0
#define NV_IS_EXPORT_SYMBOL_PRESENT_nvhost_syncpt_unit_interface_get_byte_offset 0
#define NV_IS_EXPORT_SYMBOL_PRESENT_nvhost_syncpt_unit_interface_get_aperture 0
#define NV_IS_EXPORT_SYMBOL_PRESENT_tegra_dce_register_ipc_client 0
#define NV_IS_EXPORT_SYMBOL_PRESENT_tegra_dce_unregister_ipc_client 0
#define NV_IS_EXPORT_SYMBOL_PRESENT_tegra_dce_client_ipc_send_recv 0
#define NV_IS_EXPORT_SYMBOL_PRESENT_dram_clk_to_mc_clk 0
#define NV_IS_EXPORT_SYMBOL_PRESENT_get_dram_num_channels 0
#define NV_IS_EXPORT_SYMBOL_PRESENT_tegra_dram_types 0
#define NV_IS_EXPORT_SYMBOL_PRESENT_kthread_create_on_node 1
 CONFTEST types.h:
#define NV_ACPI_DEVICE_OPS_REMOVE_ARGUMENT_COUNT 1
#undef NV_FILE_OPERATIONS_HAS_IOCTL
#define NV_FILE_HAS_INODE
#define NV_KUID_T_PRESENT
#undef NV_DMA_OPS_PRESENT
#undef NV_SWIOTLB_DMA_OPS_PRESENT
#undef NV_NONCOHERENT_SWIOTLB_DMA_OPS_PRESENT
#define NV_VM_FAULT_HAS_ADDRESS
#define NV_BACKLIGHT_PROPERTIES_TYPE_PRESENT
#undef NV_VM_INSERT_PFN_PROT_PRESENT
#define NV_VMF_INSERT_PFN_PROT_PRESENT
#define NV_ADDRESS_SPACE_INIT_ONCE_PRESENT
#define NV_VM_OPS_FAULT_REMOVED_VMA_ARG
#define NV_VMBUS_CHANNEL_HAS_RING_BUFFER_PAGE
#define NV_DEVICE_DRIVER_OF_MATCH_TABLE_PRESENT
#define NV_DEVICE_OF_NODE_PRESENT
#define NV_NODE_STATES_N_MEMORY_PRESENT
#undef NV_KMEM_CACHE_HAS_KOBJ_REMOVE_WORK
#undef NV_SYSFS_SLAB_UNLINK_PRESENT
#define NV_PROC_OPS_PRESENT
#define NV_TIMESPEC64_PRESENT
#undef NV_VMALLOC_HAS_PGPROT_T_ARG
#define NV_ACPI_FADT_LOW_POWER_S0_FLAG_PRESENT
#define NV_MM_HAS_MMAP_LOCK
#undef NV_PCI_CHANNEL_STATE_PRESENT
#undef NV_ADDRESS_SPACE_HAS_RWLOCK_TREE_LOCK
#undef NV_ADDRESS_SPACE_HAS_BACKING_DEV_INFO
#undef NV_MM_CONTEXT_T_HAS_ID
#define NV_GET_USER_PAGES_REMOTE_PRESENT
#undef NV_GET_USER_PAGES_REMOTE_HAS_WRITE_AND_FORCE_ARGS
#undef NV_GET_USER_PAGES_REMOTE_HAS_TSK_ARG
#define NV_GET_USER_PAGES_REMOTE_HAS_LOCKED_ARG
#undef NV_GET_USER_PAGES_HAS_WRITE_AND_FORCE_ARGS
#undef NV_GET_USER_PAGES_HAS_TASK_STRUCT
#define NV_VM_FAULT_T_IS_PRESENT
#define NV_MMU_NOTIFIER_OPS_HAS_INVALIDATE_RANGE
#undef NV_DRM_BUS_PRESENT
#undef NV_DRM_BUS_HAS_BUS_TYPE
#undef NV_DRM_BUS_HAS_GET_IRQ
#undef NV_DRM_BUS_HAS_GET_NAME
#undef NV_DRM_DRIVER_HAS_DEVICE_LIST
#undef NV_DRM_DRIVER_HAS_LEGACY_DEV_LIST
#undef NV_DRM_DRIVER_HAS_SET_BUSID
#define NV_DRM_CRTC_STATE_HAS_CONNECTORS_CHANGED
#define NV_DRM_CRTC_INIT_WITH_PLANES_HAS_NAME_ARG
#define NV_DRM_ENCODER_INIT_HAS_NAME_ARG
#define NV_DRM_UNIVERSAL_PLANE_INIT_HAS_FORMAT_MODIFIERS_ARG
#define NV_DRM_UNIVERSAL_PLANE_INIT_HAS_NAME_ARG
#define NV_DRM_HELPER_MODE_FILL_FB_STRUCT_HAS_DEV_ARG
#define NV_DRM_HELPER_MODE_FILL_FB_STRUCT_HAS_CONST_MODE_CMD_ARG
#undef NV_DRM_MASTER_DROP_HAS_FROM_RELEASE_ARG
#undef NV_DRM_DRIVER_UNLOAD_HAS_INT_RETURN_TYPE
#undef NV_DRM_ATOMIC_HELPER_CRTC_DESTROY_STATE_HAS_CRTC_ARG
#undef NV_DRM_ATOMIC_HELPER_PLANE_DESTROY_STATE_HAS_PLANE_ARG
#define NV_DRM_MODE_OBJECT_FIND_HAS_FILE_PRIV_ARG
#define NV_DMA_BUF_OWNER_PRESENT
#define NV_DRM_CONNECTOR_LIST_ITER_PRESENT
#define NV_DRM_CONNECTOR_LIST_ITER_BEGIN_PRESENT
#define NV_DRM_ATOMIC_HELPER_SWAP_STATE_HAS_STALL_ARG
#define NV_DRM_ATOMIC_HELPER_SWAP_STATE_RETURN_INT
#undef NV_DRM_DRIVER_PRIME_FLAG_PRESENT
#define NV_DRM_GEM_OBJECT_HAS_RESV
#define NV_DRM_CRTC_STATE_HAS_ASYNC_FLIP
#undef NV_DRM_CRTC_STATE_HAS_PAGEFLIP_FLAGS
#define NV_DRM_FORMAT_MODIFIERS_PRESENT
#define NV_DRM_VMA_NODE_IS_ALLOWED_HAS_TAG_ARG
#undef NV_DRM_VMA_OFFSET_NODE_HAS_READONLY
#undef NV_DRM_DISPLAY_MODE_HAS_VREFRESH
#undef NV_DRM_DRIVER_SET_MASTER_HAS_INT_RETURN_TYPE
#undef NV_DRM_DRIVER_HAS_GEM_FREE_OBJECT
#define NV_DRM_PRIME_PAGES_TO_SG_HAS_DRM_DEVICE_ARG
#undef NV_DRM_DRIVER_HAS_GEM_PRIME_CALLBACKS
#define NV_DRM_CRTC_ATOMIC_CHECK_HAS_ATOMIC_STATE_ARG
#define NV_DRM_GEM_OBJECT_VMAP_HAS_MAP_ARG
#define NV_DRM_PLANE_ATOMIC_CHECK_HAS_ATOMIC_STATE_ARG
 CONFTEST generic.h:
#undef NV_DOM0_KERNEL_PRESENT
#undef NV_VGPU_KVM_BUILD
#undef NV_GRID_BUILD
#undef NV_GRID_BUILD_CSP
#undef NV_GET_USER_PAGES_HAS_WRITE_AND_FORCE_ARGS
#undef NV_GET_USER_PAGES_HAS_TASK_STRUCT
#define NV_GET_USER_PAGES_REMOTE_PRESENT
#undef NV_GET_USER_PAGES_REMOTE_HAS_WRITE_AND_FORCE_ARGS
#undef NV_GET_USER_PAGES_REMOTE_HAS_TSK_ARG
#define NV_GET_USER_PAGES_REMOTE_HAS_LOCKED_ARG
#define NV_PM_RUNTIME_AVAILABLE
#define NV_VM_FAULT_T_IS_PRESENT
#define NV_PCI_CLASS_MULTIMEDIA_HD_AUDIO_PRESENT
#define NV_DRM_AVAILABLE
#define NV_DRM_ATOMIC_MODESET_AVAILABLE
#define NV_IS_EXPORT_SYMBOL_GPL_refcount_inc 0
#define NV_IS_EXPORT_SYMBOL_GPL_refcount_dec_and_test 0
#define NV_DRM_ALPHA_BLENDING_AVAILABLE
#undef NV_MLNX_IB_PEER_MEM_SYMBOLS_PRESENT
   gcc-10 -Wp,-MMD,/var/lib/dkms/nvidia-current/470.57.02/build/nvidia/.nv.o.d -nostdinc -isystem /usr/lib/gcc/x86_64-linux-gnu/10/include -I/usr/src/linux-headers-5.14.0-1-common/arch/x86/include -I./arch/x86/include/generated -I/usr/src/linux-headers-5.14.0-1-common/include -I./include -I/usr/src/linux-headers-5.14.0-1-common/arch/x86/include/uapi -I./arch/x86/include/generated/uapi -I/usr/src/linux-headers-5.14.0-1-common/include/uapi -I./include/generated/uapi -include /usr/src/linux-headers-5.14.0-1-common/include/linux/compiler-version.h -include /usr/src/linux-headers-5.14.0-1-common/include/linux/kconfig.h -include /usr/src/linux-headers-5.14.0-1-common/include/linux/compiler_types.h -D__KERNEL__ -fmacro-prefix-map=/usr/src/linux-headers-5.14.0-1-common/= -Wall -Wundef -Werror=strict-prototypes -Wno-trigraphs -fno-strict-aliasing -fno-common -fshort-wchar -fno-PIE -Werror=implicit-function-declaration -Werror=implicit-int -Werror=return-type -Wno-format-security -std=gnu89 -mno-sse -mno-mmx -mno-sse2 -mno-3dnow -mno-avx -fcf-protection=none -m64 -falign-jumps=1 -falign-loops=1 -mno-80387 -mno-fp-ret-in-387 -mpreferred-stack-boundary=3 -mskip-rax-setup -mtune=generic -mno-red-zone -mcmodel=kernel -DCONFIG_X86_X32_ABI -Wno-sign-compare -fno-asynchronous-unwind-tables -mindirect-branch=thunk-extern -mindirect-branch-register -fno-jump-tables -fno-delete-null-pointer-checks -Wno-frame-address -Wno-format-truncation -Wno-format-overflow -Wno-address-of-packed-member -O2 -fno-allow-store-data-races -Wframe-larger-than=2048 -fstack-protector-strong -Wimplicit-fallthrough=5 -Wno-main -Wno-unused-but-set-variable -Wno-unused-const-variable -fno-stack-clash-protection -g -pg -mrecord-mcount -mfentry -DCC_USING_FENTRY -Wdeclaration-after-statement -Wvla -Wno-pointer-sign -Wno-stringop-truncation -Wno-zero-length-bounds -Wno-array-bounds -Wno-stringop-overflow -Wno-restrict -Wno-maybe-uninitialized -fno-strict-overflow -fno-stack-check -fconserve-stack -Werror=date-time -Werror=incompatible-pointer-types -Werror=designated-init -Wno-packed-not-aligned -I/var/lib/dkms/nvidia-current/470.57.02/build/common/inc -I/var/lib/dkms/nvidia-current/470.57.02/build -Wall -MD -Wno-cast-qual -Wno-error -Wno-format-extra-args -D__KERNEL__ -DMODULE -DNVRM -DNV_VERSION_STRING=\"470.57.02\" -Wno-unused-function -Wuninitialized -fno-strict-aliasing -mno-red-zone -mcmodel=kernel -DNV_UVM_ENABLE -Werror=undef -DNV_SPECTRE_V2=0 -DNV_KERNEL_INTERFACE_LAYER -I/var/lib/dkms/nvidia-current/470.57.02/build/nvidia -DNVIDIA_UNDEF_LEGACY_BIT_MACROS -UDEBUG -U_DEBUG -DNDEBUG  -DMODULE  -DKBUILD_BASENAME='"nv"' -DKBUILD_MODNAME='"nvidia"' -D__KBUILD_MODNAME=kmod_nvidia -c -o /var/lib/dkms/nvidia-current/470.57.02/build/nvidia/nv.o /var/lib/dkms/nvidia-current/470.57.02/build/nvidia/nv.c
   gcc-10 -Wp,-MMD,/var/lib/dkms/nvidia-current/470.57.02/build/nvidia/.nv-pci.o.d -nostdinc -isystem /usr/lib/gcc/x86_64-linux-gnu/10/include -I/usr/src/linux-headers-5.14.0-1-common/arch/x86/include -I./arch/x86/include/generated -I/usr/src/linux-headers-5.14.0-1-common/include -I./include -I/usr/src/linux-headers-5.14.0-1-common/arch/x86/include/uapi -I./arch/x86/include/generated/uapi -I/usr/src/linux-headers-5.14.0-1-common/include/uapi -I./include/generated/uapi -include /usr/src/linux-headers-5.14.0-1-common/include/linux/compiler-version.h -include /usr/src/linux-headers-5.14.0-1-common/include/linux/kconfig.h -include /usr/src/linux-headers-5.14.0-1-common/include/linux/compiler_types.h -D__KERNEL__ -fmacro-prefix-map=/usr/src/linux-headers-5.14.0-1-common/= -Wall -Wundef -Werror=strict-prototypes -Wno-trigraphs -fno-strict-aliasing -fno-common -fshort-wchar -fno-PIE -Werror=implicit-function-declaration -Werror=implicit-int -Werror=return-type -Wno-format-security -std=gnu89 -mno-sse -mno-mmx -mno-sse2 -mno-3dnow -mno-avx -fcf-protection=none -m64 -falign-jumps=1 -falign-loops=1 -mno-80387 -mno-fp-ret-in-387 -mpreferred-stack-boundary=3 -mskip-rax-setup -mtune=generic -mno-red-zone -mcmodel=kernel -DCONFIG_X86_X32_ABI -Wno-sign-compare -fno-asynchronous-unwind-tables -mindirect-branch=thunk-extern -mindirect-branch-register -fno-jump-tables -fno-delete-null-pointer-checks -Wno-frame-address -Wno-format-truncation -Wno-format-overflow -Wno-address-of-packed-member -O2 -fno-allow-store-data-races -Wframe-larger-than=2048 -fstack-protector-strong -Wimplicit-fallthrough=5 -Wno-main -Wno-unused-but-set-variable -Wno-unused-const-variable -fno-stack-clash-protection -g -pg -mrecord-mcount -mfentry -DCC_USING_FENTRY -Wdeclaration-after-statement -Wvla -Wno-pointer-sign -Wno-stringop-truncation -Wno-zero-length-bounds -Wno-array-bounds -Wno-stringop-overflow -Wno-restrict -Wno-maybe-uninitialized -fno-strict-overflow -fno-stack-check -fconserve-stack -Werror=date-time -Werror=incompatible-pointer-types -Werror=designated-init -Wno-packed-not-aligned -I/var/lib/dkms/nvidia-current/470.57.02/build/common/inc -I/var/lib/dkms/nvidia-current/470.57.02/build -Wall -MD -Wno-cast-qual -Wno-error -Wno-format-extra-args -D__KERNEL__ -DMODULE -DNVRM -DNV_VERSION_STRING=\"470.57.02\" -Wno-unused-function -Wuninitialized -fno-strict-aliasing -mno-red-zone -mcmodel=kernel -DNV_UVM_ENABLE -Werror=undef -DNV_SPECTRE_V2=0 -DNV_KERNEL_INTERFACE_LAYER -I/var/lib/dkms/nvidia-current/470.57.02/build/nvidia -DNVIDIA_UNDEF_LEGACY_BIT_MACROS -UDEBUG -U_DEBUG -DNDEBUG  -DMODULE  -DKBUILD_BASENAME='"nv_pci"' -DKBUILD_MODNAME='"nvidia"' -D__KBUILD_MODNAME=kmod_nvidia -c -o /var/lib/dkms/nvidia-current/470.57.02/build/nvidia/nv-pci.o /var/lib/dkms/nvidia-current/470.57.02/build/nvidia/nv-pci.c
   gcc-10 -Wp,-MMD,/var/lib/dkms/nvidia-current/470.57.02/build/nvidia/.nv-acpi.o.d -nostdinc -isystem /usr/lib/gcc/x86_64-linux-gnu/10/include -I/usr/src/linux-headers-5.14.0-1-common/arch/x86/include -I./arch/x86/include/generated -I/usr/src/linux-headers-5.14.0-1-common/include -I./include -I/usr/src/linux-headers-5.14.0-1-common/arch/x86/include/uapi -I./arch/x86/include/generated/uapi -I/usr/src/linux-headers-5.14.0-1-common/include/uapi -I./include/generated/uapi -include /usr/src/linux-headers-5.14.0-1-common/include/linux/compiler-version.h -include /usr/src/linux-headers-5.14.0-1-common/include/linux/kconfig.h -include /usr/src/linux-headers-5.14.0-1-common/include/linux/compiler_types.h -D__KERNEL__ -fmacro-prefix-map=/usr/src/linux-headers-5.14.0-1-common/= -Wall -Wundef -Werror=strict-prototypes -Wno-trigraphs -fno-strict-aliasing -fno-common -fshort-wchar -fno-PIE -Werror=implicit-function-declaration -Werror=implicit-int -Werror=return-type -Wno-format-security -std=gnu89 -mno-sse -mno-mmx -mno-sse2 -mno-3dnow -mno-avx -fcf-protection=none -m64 -falign-jumps=1 -falign-loops=1 -mno-80387 -mno-fp-ret-in-387 -mpreferred-stack-boundary=3 -mskip-rax-setup -mtune=generic -mno-red-zone -mcmodel=kernel -DCONFIG_X86_X32_ABI -Wno-sign-compare -fno-asynchronous-unwind-tables -mindirect-branch=thunk-extern -mindirect-branch-register -fno-jump-tables -fno-delete-null-pointer-checks -Wno-frame-address -Wno-format-truncation -Wno-format-overflow -Wno-address-of-packed-member -O2 -fno-allow-store-data-races -Wframe-larger-than=2048 -fstack-protector-strong -Wimplicit-fallthrough=5 -Wno-main -Wno-unused-but-set-variable -Wno-unused-const-variable -fno-stack-clash-protection -g -pg -mrecord-mcount -mfentry -DCC_USING_FENTRY -Wdeclaration-after-statement -Wvla -Wno-pointer-sign -Wno-stringop-truncation -Wno-zero-length-bounds -Wno-array-bounds -Wno-stringop-overflow -Wno-restrict -Wno-maybe-uninitialized -fno-strict-overflow -fno-stack-check -fconserve-stack -Werror=date-time -Werror=incompatible-pointer-types -Werror=designated-init -Wno-packed-not-aligned -I/var/lib/dkms/nvidia-current/470.57.02/build/common/inc -I/var/lib/dkms/nvidia-current/470.57.02/build -Wall -MD -Wno-cast-qual -Wno-error -Wno-format-extra-args -D__KERNEL__ -DMODULE -DNVRM -DNV_VERSION_STRING=\"470.57.02\" -Wno-unused-function -Wuninitialized -fno-strict-aliasing -mno-red-zone -mcmodel=kernel -DNV_UVM_ENABLE -Werror=undef -DNV_SPECTRE_V2=0 -DNV_KERNEL_INTERFACE_LAYER -I/var/lib/dkms/nvidia-current/470.57.02/build/nvidia -DNVIDIA_UNDEF_LEGACY_BIT_MACROS -UDEBUG -U_DEBUG -DNDEBUG  -DMODULE  -DKBUILD_BASENAME='"nv_acpi"' -DKBUILD_MODNAME='"nvidia"' -D__KBUILD_MODNAME=kmod_nvidia -c -o /var/lib/dkms/nvidia-current/470.57.02/build/nvidia/nv-acpi.o /var/lib/dkms/nvidia-current/470.57.02/build/nvidia/nv-acpi.c
   gcc-10 -Wp,-MMD,/var/lib/dkms/nvidia-current/470.57.02/build/nvidia/.nv-cray.o.d -nostdinc -isystem /usr/lib/gcc/x86_64-linux-gnu/10/include -I/usr/src/linux-headers-5.14.0-1-common/arch/x86/include -I./arch/x86/include/generated -I/usr/src/linux-headers-5.14.0-1-common/include -I./include -I/usr/src/linux-headers-5.14.0-1-common/arch/x86/include/uapi -I./arch/x86/include/generated/uapi -I/usr/src/linux-headers-5.14.0-1-common/include/uapi -I./include/generated/uapi -include /usr/src/linux-headers-5.14.0-1-common/include/linux/compiler-version.h -include /usr/src/linux-headers-5.14.0-1-common/include/linux/kconfig.h -include /usr/src/linux-headers-5.14.0-1-common/include/linux/compiler_types.h -D__KERNEL__ -fmacro-prefix-map=/usr/src/linux-headers-5.14.0-1-common/= -Wall -Wundef -Werror=strict-prototypes -Wno-trigraphs -fno-strict-aliasing -fno-common -fshort-wchar -fno-PIE -Werror=implicit-function-declaration -Werror=implicit-int -Werror=return-type -Wno-format-security -std=gnu89 -mno-sse -mno-mmx -mno-sse2 -mno-3dnow -mno-avx -fcf-protection=none -m64 -falign-jumps=1 -falign-loops=1 -mno-80387 -mno-fp-ret-in-387 -mpreferred-stack-boundary=3 -mskip-rax-setup -mtune=generic -mno-red-zone -mcmodel=kernel -DCONFIG_X86_X32_ABI -Wno-sign-compare -fno-asynchronous-unwind-tables -mindirect-branch=thunk-extern -mindirect-branch-register -fno-jump-tables -fno-delete-null-pointer-checks -Wno-frame-address -Wno-format-truncation -Wno-format-overflow -Wno-address-of-packed-member -O2 -fno-allow-store-data-races -Wframe-larger-than=2048 -fstack-protector-strong -Wimplicit-fallthrough=5 -Wno-main -Wno-unused-but-set-variable -Wno-unused-const-variable -fno-stack-clash-protection -g -pg -mrecord-mcount -mfentry -DCC_USING_FENTRY -Wdeclaration-after-statement -Wvla -Wno-pointer-sign -Wno-stringop-truncation -Wno-zero-length-bounds -Wno-array-bounds -Wno-stringop-overflow -Wno-restrict -Wno-maybe-uninitialized -fno-strict-overflow -fno-stack-check -fconserve-stack -Werror=date-time -Werror=incompatible-pointer-types -Werror=designated-init -Wno-packed-not-aligned -I/var/lib/dkms/nvidia-current/470.57.02/build/common/inc -I/var/lib/dkms/nvidia-current/470.57.02/build -Wall -MD -Wno-cast-qual -Wno-error -Wno-format-extra-args -D__KERNEL__ -DMODULE -DNVRM -DNV_VERSION_STRING=\"470.57.02\" -Wno-unused-function -Wuninitialized -fno-strict-aliasing -mno-red-zone -mcmodel=kernel -DNV_UVM_ENABLE -Werror=undef -DNV_SPECTRE_V2=0 -DNV_KERNEL_INTERFACE_LAYER -I/var/lib/dkms/nvidia-current/470.57.02/build/nvidia -DNVIDIA_UNDEF_LEGACY_BIT_MACROS -UDEBUG -U_DEBUG -DNDEBUG  -DMODULE  -DKBUILD_BASENAME='"nv_cray"' -DKBUILD_MODNAME='"nvidia"' -D__KBUILD_MODNAME=kmod_nvidia -c -o /var/lib/dkms/nvidia-current/470.57.02/build/nvidia/nv-cray.o /var/lib/dkms/nvidia-current/470.57.02/build/nvidia/nv-cray.c
   gcc-10 -Wp,-MMD,/var/lib/dkms/nvidia-current/470.57.02/build/nvidia/.nv-dma.o.d -nostdinc -isystem /usr/lib/gcc/x86_64-linux-gnu/10/include -I/usr/src/linux-headers-5.14.0-1-common/arch/x86/include -I./arch/x86/include/generated -I/usr/src/linux-headers-5.14.0-1-common/include -I./include -I/usr/src/linux-headers-5.14.0-1-common/arch/x86/include/uapi -I./arch/x86/include/generated/uapi -I/usr/src/linux-headers-5.14.0-1-common/include/uapi -I./include/generated/uapi -include /usr/src/linux-headers-5.14.0-1-common/include/linux/compiler-version.h -include /usr/src/linux-headers-5.14.0-1-common/include/linux/kconfig.h -include /usr/src/linux-headers-5.14.0-1-common/include/linux/compiler_types.h -D__KERNEL__ -fmacro-prefix-map=/usr/src/linux-headers-5.14.0-1-common/= -Wall -Wundef -Werror=strict-prototypes -Wno-trigraphs -fno-strict-aliasing -fno-common -fshort-wchar -fno-PIE -Werror=implicit-function-declaration -Werror=implicit-int -Werror=return-type -Wno-format-security -std=gnu89 -mno-sse -mno-mmx -mno-sse2 -mno-3dnow -mno-avx -fcf-protection=none -m64 -falign-jumps=1 -falign-loops=1 -mno-80387 -mno-fp-ret-in-387 -mpreferred-stack-boundary=3 -mskip-rax-setup -mtune=generic -mno-red-zone -mcmodel=kernel -DCONFIG_X86_X32_ABI -Wno-sign-compare -fno-asynchronous-unwind-tables -mindirect-branch=thunk-extern -mindirect-branch-register -fno-jump-tables -fno-delete-null-pointer-checks -Wno-frame-address -Wno-format-truncation -Wno-format-overflow -Wno-address-of-packed-member -O2 -fno-allow-store-data-races -Wframe-larger-than=2048 -fstack-protector-strong -Wimplicit-fallthrough=5 -Wno-main -Wno-unused-but-set-variable -Wno-unused-const-variable -fno-stack-clash-protection -g -pg -mrecord-mcount -mfentry -DCC_USING_FENTRY -Wdeclaration-after-statement -Wvla -Wno-pointer-sign -Wno-stringop-truncation -Wno-zero-length-bounds -Wno-array-bounds -Wno-stringop-overflow -Wno-restrict -Wno-maybe-uninitialized -fno-strict-overflow -fno-stack-check -fconserve-stack -Werror=date-time -Werror=incompatible-pointer-types -Werror=designated-init -Wno-packed-not-aligned -I/var/lib/dkms/nvidia-current/470.57.02/build/common/inc -I/var/lib/dkms/nvidia-current/470.57.02/build -Wall -MD -Wno-cast-qual -Wno-error -Wno-format-extra-args -D__KERNEL__ -DMODULE -DNVRM -DNV_VERSION_STRING=\"470.57.02\" -Wno-unused-function -Wuninitialized -fno-strict-aliasing -mno-red-zone -mcmodel=kernel -DNV_UVM_ENABLE -Werror=undef -DNV_SPECTRE_V2=0 -DNV_KERNEL_INTERFACE_LAYER -I/var/lib/dkms/nvidia-current/470.57.02/build/nvidia -DNVIDIA_UNDEF_LEGACY_BIT_MACROS -UDEBUG -U_DEBUG -DNDEBUG  -DMODULE  -DKBUILD_BASENAME='"nv_dma"' -DKBUILD_MODNAME='"nvidia"' -D__KBUILD_MODNAME=kmod_nvidia -c -o /var/lib/dkms/nvidia-current/470.57.02/build/nvidia/nv-dma.o /var/lib/dkms/nvidia-current/470.57.02/build/nvidia/nv-dma.c
   gcc-10 -Wp,-MMD,/var/lib/dkms/nvidia-current/470.57.02/build/nvidia/.nv-i2c.o.d -nostdinc -isystem /usr/lib/gcc/x86_64-linux-gnu/10/include -I/usr/src/linux-headers-5.14.0-1-common/arch/x86/include -I./arch/x86/include/generated -I/usr/src/linux-headers-5.14.0-1-common/include -I./include -I/usr/src/linux-headers-5.14.0-1-common/arch/x86/include/uapi -I./arch/x86/include/generated/uapi -I/usr/src/linux-headers-5.14.0-1-common/include/uapi -I./include/generated/uapi -include /usr/src/linux-headers-5.14.0-1-common/include/linux/compiler-version.h -include /usr/src/linux-headers-5.14.0-1-common/include/linux/kconfig.h -include /usr/src/linux-headers-5.14.0-1-common/include/linux/compiler_types.h -D__KERNEL__ -fmacro-prefix-map=/usr/src/linux-headers-5.14.0-1-common/= -Wall -Wundef -Werror=strict-prototypes -Wno-trigraphs -fno-strict-aliasing -fno-common -fshort-wchar -fno-PIE -Werror=implicit-function-declaration -Werror=implicit-int -Werror=return-type -Wno-format-security -std=gnu89 -mno-sse -mno-mmx -mno-sse2 -mno-3dnow -mno-avx -fcf-protection=none -m64 -falign-jumps=1 -falign-loops=1 -mno-80387 -mno-fp-ret-in-387 -mpreferred-stack-boundary=3 -mskip-rax-setup -mtune=generic -mno-red-zone -mcmodel=kernel -DCONFIG_X86_X32_ABI -Wno-sign-compare -fno-asynchronous-unwind-tables -mindirect-branch=thunk-extern -mindirect-branch-register -fno-jump-tables -fno-delete-null-pointer-checks -Wno-frame-address -Wno-format-truncation -Wno-format-overflow -Wno-address-of-packed-member -O2 -fno-allow-store-data-races -Wframe-larger-than=2048 -fstack-protector-strong -Wimplicit-fallthrough=5 -Wno-main -Wno-unused-but-set-variable -Wno-unused-const-variable -fno-stack-clash-protection -g -pg -mrecord-mcount -mfentry -DCC_USING_FENTRY -Wdeclaration-after-statement -Wvla -Wno-pointer-sign -Wno-stringop-truncation -Wno-zero-length-bounds -Wno-array-bounds -Wno-stringop-overflow -Wno-restrict -Wno-maybe-uninitialized -fno-strict-overflow -fno-stack-check -fconserve-stack -Werror=date-time -Werror=incompatible-pointer-types -Werror=designated-init -Wno-packed-not-aligned -I/var/lib/dkms/nvidia-current/470.57.02/build/common/inc -I/var/lib/dkms/nvidia-current/470.57.02/build -Wall -MD -Wno-cast-qual -Wno-error -Wno-format-extra-args -D__KERNEL__ -DMODULE -DNVRM -DNV_VERSION_STRING=\"470.57.02\" -Wno-unused-function -Wuninitialized -fno-strict-aliasing -mno-red-zone -mcmodel=kernel -DNV_UVM_ENABLE -Werror=undef -DNV_SPECTRE_V2=0 -DNV_KERNEL_INTERFACE_LAYER -I/var/lib/dkms/nvidia-current/470.57.02/build/nvidia -DNVIDIA_UNDEF_LEGACY_BIT_MACROS -UDEBUG -U_DEBUG -DNDEBUG  -DMODULE  -DKBUILD_BASENAME='"nv_i2c"' -DKBUILD_MODNAME='"nvidia"' -D__KBUILD_MODNAME=kmod_nvidia -c -o /var/lib/dkms/nvidia-current/470.57.02/build/nvidia/nv-i2c.o /var/lib/dkms/nvidia-current/470.57.02/build/nvidia/nv-i2c.c
   gcc-10 -Wp,-MMD,/var/lib/dkms/nvidia-current/470.57.02/build/nvidia/.nv-mmap.o.d -nostdinc -isystem /usr/lib/gcc/x86_64-linux-gnu/10/include -I/usr/src/linux-headers-5.14.0-1-common/arch/x86/include -I./arch/x86/include/generated -I/usr/src/linux-headers-5.14.0-1-common/include -I./include -I/usr/src/linux-headers-5.14.0-1-common/arch/x86/include/uapi -I./arch/x86/include/generated/uapi -I/usr/src/linux-headers-5.14.0-1-common/include/uapi -I./include/generated/uapi -include /usr/src/linux-headers-5.14.0-1-common/include/linux/compiler-version.h -include /usr/src/linux-headers-5.14.0-1-common/include/linux/kconfig.h -include /usr/src/linux-headers-5.14.0-1-common/include/linux/compiler_types.h -D__KERNEL__ -fmacro-prefix-map=/usr/src/linux-headers-5.14.0-1-common/= -Wall -Wundef -Werror=strict-prototypes -Wno-trigraphs -fno-strict-aliasing -fno-common -fshort-wchar -fno-PIE -Werror=implicit-function-declaration -Werror=implicit-int -Werror=return-type -Wno-format-security -std=gnu89 -mno-sse -mno-mmx -mno-sse2 -mno-3dnow -mno-avx -fcf-protection=none -m64 -falign-jumps=1 -falign-loops=1 -mno-80387 -mno-fp-ret-in-387 -mpreferred-stack-boundary=3 -mskip-rax-setup -mtune=generic -mno-red-zone -mcmodel=kernel -DCONFIG_X86_X32_ABI -Wno-sign-compare -fno-asynchronous-unwind-tables -mindirect-branch=thunk-extern -mindirect-branch-register -fno-jump-tables -fno-delete-null-pointer-checks -Wno-frame-address -Wno-format-truncation -Wno-format-overflow -Wno-address-of-packed-member -O2 -fno-allow-store-data-races -Wframe-larger-than=2048 -fstack-protector-strong -Wimplicit-fallthrough=5 -Wno-main -Wno-unused-but-set-variable -Wno-unused-const-variable -fno-stack-clash-protection -g -pg -mrecord-mcount -mfentry -DCC_USING_FENTRY -Wdeclaration-after-statement -Wvla -Wno-pointer-sign -Wno-stringop-truncation -Wno-zero-length-bounds -Wno-array-bounds -Wno-stringop-overflow -Wno-restrict -Wno-maybe-uninitialized -fno-strict-overflow -fno-stack-check -fconserve-stack -Werror=date-time -Werror=incompatible-pointer-types -Werror=designated-init -Wno-packed-not-aligned -I/var/lib/dkms/nvidia-current/470.57.02/build/common/inc -I/var/lib/dkms/nvidia-current/470.57.02/build -Wall -MD -Wno-cast-qual -Wno-error -Wno-format-extra-args -D__KERNEL__ -DMODULE -DNVRM -DNV_VERSION_STRING=\"470.57.02\" -Wno-unused-function -Wuninitialized -fno-strict-aliasing -mno-red-zone -mcmodel=kernel -DNV_UVM_ENABLE -Werror=undef -DNV_SPECTRE_V2=0 -DNV_KERNEL_INTERFACE_LAYER -I/var/lib/dkms/nvidia-current/470.57.02/build/nvidia -DNVIDIA_UNDEF_LEGACY_BIT_MACROS -UDEBUG -U_DEBUG -DNDEBUG  -DMODULE  -DKBUILD_BASENAME='"nv_mmap"' -DKBUILD_MODNAME='"nvidia"' -D__KBUILD_MODNAME=kmod_nvidia -c -o /var/lib/dkms/nvidia-current/470.57.02/build/nvidia/nv-mmap.o /var/lib/dkms/nvidia-current/470.57.02/build/nvidia/nv-mmap.c
   gcc-10 -Wp,-MMD,/var/lib/dkms/nvidia-current/470.57.02/build/nvidia/.nv-p2p.o.d -nostdinc -isystem /usr/lib/gcc/x86_64-linux-gnu/10/include -I/usr/src/linux-headers-5.14.0-1-common/arch/x86/include -I./arch/x86/include/generated -I/usr/src/linux-headers-5.14.0-1-common/include -I./include -I/usr/src/linux-headers-5.14.0-1-common/arch/x86/include/uapi -I./arch/x86/include/generated/uapi -I/usr/src/linux-headers-5.14.0-1-common/include/uapi -I./include/generated/uapi -include /usr/src/linux-headers-5.14.0-1-common/include/linux/compiler-version.h -include /usr/src/linux-headers-5.14.0-1-common/include/linux/kconfig.h -include /usr/src/linux-headers-5.14.0-1-common/include/linux/compiler_types.h -D__KERNEL__ -fmacro-prefix-map=/usr/src/linux-headers-5.14.0-1-common/= -Wall -Wundef -Werror=strict-prototypes -Wno-trigraphs -fno-strict-aliasing -fno-common -fshort-wchar -fno-PIE -Werror=implicit-function-declaration -Werror=implicit-int -Werror=return-type -Wno-format-security -std=gnu89 -mno-sse -mno-mmx -mno-sse2 -mno-3dnow -mno-avx -fcf-protection=none -m64 -falign-jumps=1 -falign-loops=1 -mno-80387 -mno-fp-ret-in-387 -mpreferred-stack-boundary=3 -mskip-rax-setup -mtune=generic -mno-red-zone -mcmodel=kernel -DCONFIG_X86_X32_ABI -Wno-sign-compare -fno-asynchronous-unwind-tables -mindirect-branch=thunk-extern -mindirect-branch-register -fno-jump-tables -fno-delete-null-pointer-checks -Wno-frame-address -Wno-format-truncation -Wno-format-overflow -Wno-address-of-packed-member -O2 -fno-allow-store-data-races -Wframe-larger-than=2048 -fstack-protector-strong -Wimplicit-fallthrough=5 -Wno-main -Wno-unused-but-set-variable -Wno-unused-const-variable -fno-stack-clash-protection -g -pg -mrecord-mcount -mfentry -DCC_USING_FENTRY -Wdeclaration-after-statement -Wvla -Wno-pointer-sign -Wno-stringop-truncation -Wno-zero-length-bounds -Wno-array-bounds -Wno-stringop-overflow -Wno-restrict -Wno-maybe-uninitialized -fno-strict-overflow -fno-stack-check -fconserve-stack -Werror=date-time -Werror=incompatible-pointer-types -Werror=designated-init -Wno-packed-not-aligned -I/var/lib/dkms/nvidia-current/470.57.02/build/common/inc -I/var/lib/dkms/nvidia-current/470.57.02/build -Wall -MD -Wno-cast-qual -Wno-error -Wno-format-extra-args -D__KERNEL__ -DMODULE -DNVRM -DNV_VERSION_STRING=\"470.57.02\" -Wno-unused-function -Wuninitialized -fno-strict-aliasing -mno-red-zone -mcmodel=kernel -DNV_UVM_ENABLE -Werror=undef -DNV_SPECTRE_V2=0 -DNV_KERNEL_INTERFACE_LAYER -I/var/lib/dkms/nvidia-current/470.57.02/build/nvidia -DNVIDIA_UNDEF_LEGACY_BIT_MACROS -UDEBUG -U_DEBUG -DNDEBUG  -DMODULE  -DKBUILD_BASENAME='"nv_p2p"' -DKBUILD_MODNAME='"nvidia"' -D__KBUILD_MODNAME=kmod_nvidia -c -o /var/lib/dkms/nvidia-current/470.57.02/build/nvidia/nv-p2p.o /var/lib/dkms/nvidia-current/470.57.02/build/nvidia/nv-p2p.c
   gcc-10 -Wp,-MMD,/var/lib/dkms/nvidia-current/470.57.02/build/nvidia/.nv-pat.o.d -nostdinc -isystem /usr/lib/gcc/x86_64-linux-gnu/10/include -I/usr/src/linux-headers-5.14.0-1-common/arch/x86/include -I./arch/x86/include/generated -I/usr/src/linux-headers-5.14.0-1-common/include -I./include -I/usr/src/linux-headers-5.14.0-1-common/arch/x86/include/uapi -I./arch/x86/include/generated/uapi -I/usr/src/linux-headers-5.14.0-1-common/include/uapi -I./include/generated/uapi -include /usr/src/linux-headers-5.14.0-1-common/include/linux/compiler-version.h -include /usr/src/linux-headers-5.14.0-1-common/include/linux/kconfig.h -include /usr/src/linux-headers-5.14.0-1-common/include/linux/compiler_types.h -D__KERNEL__ -fmacro-prefix-map=/usr/src/linux-headers-5.14.0-1-common/= -Wall -Wundef -Werror=strict-prototypes -Wno-trigraphs -fno-strict-aliasing -fno-common -fshort-wchar -fno-PIE -Werror=implicit-function-declaration -Werror=implicit-int -Werror=return-type -Wno-format-security -std=gnu89 -mno-sse -mno-mmx -mno-sse2 -mno-3dnow -mno-avx -fcf-protection=none -m64 -falign-jumps=1 -falign-loops=1 -mno-80387 -mno-fp-ret-in-387 -mpreferred-stack-boundary=3 -mskip-rax-setup -mtune=generic -mno-red-zone -mcmodel=kernel -DCONFIG_X86_X32_ABI -Wno-sign-compare -fno-asynchronous-unwind-tables -mindirect-branch=thunk-extern -mindirect-branch-register -fno-jump-tables -fno-delete-null-pointer-checks -Wno-frame-address -Wno-format-truncation -Wno-format-overflow -Wno-address-of-packed-member -O2 -fno-allow-store-data-races -Wframe-larger-than=2048 -fstack-protector-strong -Wimplicit-fallthrough=5 -Wno-main -Wno-unused-but-set-variable -Wno-unused-const-variable -fno-stack-clash-protection -g -pg -mrecord-mcount -mfentry -DCC_USING_FENTRY -Wdeclaration-after-statement -Wvla -Wno-pointer-sign -Wno-stringop-truncation -Wno-zero-length-bounds -Wno-array-bounds -Wno-stringop-overflow -Wno-restrict -Wno-maybe-uninitialized -fno-strict-overflow -fno-stack-check -fconserve-stack -Werror=date-time -Werror=incompatible-pointer-types -Werror=designated-init -Wno-packed-not-aligned -I/var/lib/dkms/nvidia-current/470.57.02/build/common/inc -I/var/lib/dkms/nvidia-current/470.57.02/build -Wall -MD -Wno-cast-qual -Wno-error -Wno-format-extra-args -D__KERNEL__ -DMODULE -DNVRM -DNV_VERSION_STRING=\"470.57.02\" -Wno-unused-function -Wuninitialized -fno-strict-aliasing -mno-red-zone -mcmodel=kernel -DNV_UVM_ENABLE -Werror=undef -DNV_SPECTRE_V2=0 -DNV_KERNEL_INTERFACE_LAYER -I/var/lib/dkms/nvidia-current/470.57.02/build/nvidia -DNVIDIA_UNDEF_LEGACY_BIT_MACROS -UDEBUG -U_DEBUG -DNDEBUG  -DMODULE  -DKBUILD_BASENAME='"nv_pat"' -DKBUILD_MODNAME='"nvidia"' -D__KBUILD_MODNAME=kmod_nvidia -c -o /var/lib/dkms/nvidia-current/470.57.02/build/nvidia/nv-pat.o /var/lib/dkms/nvidia-current/470.57.02/build/nvidia/nv-pat.c
   gcc-10 -Wp,-MMD,/var/lib/dkms/nvidia-current/470.57.02/build/nvidia/.nv-procfs.o.d -nostdinc -isystem /usr/lib/gcc/x86_64-linux-gnu/10/include -I/usr/src/linux-headers-5.14.0-1-common/arch/x86/include -I./arch/x86/include/generated -I/usr/src/linux-headers-5.14.0-1-common/include -I./include -I/usr/src/linux-headers-5.14.0-1-common/arch/x86/include/uapi -I./arch/x86/include/generated/uapi -I/usr/src/linux-headers-5.14.0-1-common/include/uapi -I./include/generated/uapi -include /usr/src/linux-headers-5.14.0-1-common/include/linux/compiler-version.h -include /usr/src/linux-headers-5.14.0-1-common/include/linux/kconfig.h -include /usr/src/linux-headers-5.14.0-1-common/include/linux/compiler_types.h -D__KERNEL__ -fmacro-prefix-map=/usr/src/linux-headers-5.14.0-1-common/= -Wall -Wundef -Werror=strict-prototypes -Wno-trigraphs -fno-strict-aliasing -fno-common -fshort-wchar -fno-PIE -Werror=implicit-function-declaration -Werror=implicit-int -Werror=return-type -Wno-format-security -std=gnu89 -mno-sse -mno-mmx -mno-sse2 -mno-3dnow -mno-avx -fcf-protection=none -m64 -falign-jumps=1 -falign-loops=1 -mno-80387 -mno-fp-ret-in-387 -mpreferred-stack-boundary=3 -mskip-rax-setup -mtune=generic -mno-red-zone -mcmodel=kernel -DCONFIG_X86_X32_ABI -Wno-sign-compare -fno-asynchronous-unwind-tables -mindirect-branch=thunk-extern -mindirect-branch-register -fno-jump-tables -fno-delete-null-pointer-checks -Wno-frame-address -Wno-format-truncation -Wno-format-overflow -Wno-address-of-packed-member -O2 -fno-allow-store-data-races -Wframe-larger-than=2048 -fstack-protector-strong -Wimplicit-fallthrough=5 -Wno-main -Wno-unused-but-set-variable -Wno-unused-const-variable -fno-stack-clash-protection -g -pg -mrecord-mcount -mfentry -DCC_USING_FENTRY -Wdeclaration-after-statement -Wvla -Wno-pointer-sign -Wno-stringop-truncation -Wno-zero-length-bounds -Wno-array-bounds -Wno-stringop-overflow -Wno-restrict -Wno-maybe-uninitialized -fno-strict-overflow -fno-stack-check -fconserve-stack -Werror=date-time -Werror=incompatible-pointer-types -Werror=designated-init -Wno-packed-not-aligned -I/var/lib/dkms/nvidia-current/470.57.02/build/common/inc -I/var/lib/dkms/nvidia-current/470.57.02/build -Wall -MD -Wno-cast-qual -Wno-error -Wno-format-extra-args -D__KERNEL__ -DMODULE -DNVRM -DNV_VERSION_STRING=\"470.57.02\" -Wno-unused-function -Wuninitialized -fno-strict-aliasing -mno-red-zone -mcmodel=kernel -DNV_UVM_ENABLE -Werror=undef -DNV_SPECTRE_V2=0 -DNV_KERNEL_INTERFACE_LAYER -I/var/lib/dkms/nvidia-current/470.57.02/build/nvidia -DNVIDIA_UNDEF_LEGACY_BIT_MACROS -UDEBUG -U_DEBUG -DNDEBUG  -DMODULE  -DKBUILD_BASENAME='"nv_procfs"' -DKBUILD_MODNAME='"nvidia"' -D__KBUILD_MODNAME=kmod_nvidia -c -o /var/lib/dkms/nvidia-current/470.57.02/build/nvidia/nv-procfs.o /var/lib/dkms/nvidia-current/470.57.02/build/nvidia/nv-procfs.c
   gcc-10 -Wp,-MMD,/var/lib/dkms/nvidia-current/470.57.02/build/nvidia/.nv-procfs-utils.o.d -nostdinc -isystem /usr/lib/gcc/x86_64-linux-gnu/10/include -I/usr/src/linux-headers-5.14.0-1-common/arch/x86/include -I./arch/x86/include/generated -I/usr/src/linux-headers-5.14.0-1-common/include -I./include -I/usr/src/linux-headers-5.14.0-1-common/arch/x86/include/uapi -I./arch/x86/include/generated/uapi -I/usr/src/linux-headers-5.14.0-1-common/include/uapi -I./include/generated/uapi -include /usr/src/linux-headers-5.14.0-1-common/include/linux/compiler-version.h -include /usr/src/linux-headers-5.14.0-1-common/include/linux/kconfig.h -include /usr/src/linux-headers-5.14.0-1-common/include/linux/compiler_types.h -D__KERNEL__ -fmacro-prefix-map=/usr/src/linux-headers-5.14.0-1-common/= -Wall -Wundef -Werror=strict-prototypes -Wno-trigraphs -fno-strict-aliasing -fno-common -fshort-wchar -fno-PIE -Werror=implicit-function-declaration -Werror=implicit-int -Werror=return-type -Wno-format-security -std=gnu89 -mno-sse -mno-mmx -mno-sse2 -mno-3dnow -mno-avx -fcf-protection=none -m64 -falign-jumps=1 -falign-loops=1 -mno-80387 -mno-fp-ret-in-387 -mpreferred-stack-boundary=3 -mskip-rax-setup -mtune=generic -mno-red-zone -mcmodel=kernel -DCONFIG_X86_X32_ABI -Wno-sign-compare -fno-asynchronous-unwind-tables -mindirect-branch=thunk-extern -mindirect-branch-register -fno-jump-tables -fno-delete-null-pointer-checks -Wno-frame-address -Wno-format-truncation -Wno-format-overflow -Wno-address-of-packed-member -O2 -fno-allow-store-data-races -Wframe-larger-than=2048 -fstack-protector-strong -Wimplicit-fallthrough=5 -Wno-main -Wno-unused-but-set-variable -Wno-unused-const-variable -fno-stack-clash-protection -g -pg -mrecord-mcount -mfentry -DCC_USING_FENTRY -Wdeclaration-after-statement -Wvla -Wno-pointer-sign -Wno-stringop-truncation -Wno-zero-length-bounds -Wno-array-bounds -Wno-stringop-overflow -Wno-restrict -Wno-maybe-uninitialized -fno-strict-overflow -fno-stack-check -fconserve-stack -Werror=date-time -Werror=incompatible-pointer-types -Werror=designated-init -Wno-packed-not-aligned -I/var/lib/dkms/nvidia-current/470.57.02/build/common/inc -I/var/lib/dkms/nvidia-current/470.57.02/build -Wall -MD -Wno-cast-qual -Wno-error -Wno-format-extra-args -D__KERNEL__ -DMODULE -DNVRM -DNV_VERSION_STRING=\"470.57.02\" -Wno-unused-function -Wuninitialized -fno-strict-aliasing -mno-red-zone -mcmodel=kernel -DNV_UVM_ENABLE -Werror=undef -DNV_SPECTRE_V2=0 -DNV_KERNEL_INTERFACE_LAYER -I/var/lib/dkms/nvidia-current/470.57.02/build/nvidia -DNVIDIA_UNDEF_LEGACY_BIT_MACROS -UDEBUG -U_DEBUG -DNDEBUG  -DMODULE  -DKBUILD_BASENAME='"nv_procfs_utils"' -DKBUILD_MODNAME='"nvidia"' -D__KBUILD_MODNAME=kmod_nvidia -c -o /var/lib/dkms/nvidia-current/470.57.02/build/nvidia/nv-procfs-utils.o /var/lib/dkms/nvidia-current/470.57.02/build/nvidia/nv-procfs-utils.c
   gcc-10 -Wp,-MMD,/var/lib/dkms/nvidia-current/470.57.02/build/nvidia/.nv-usermap.o.d -nostdinc -isystem /usr/lib/gcc/x86_64-linux-gnu/10/include -I/usr/src/linux-headers-5.14.0-1-common/arch/x86/include -I./arch/x86/include/generated -I/usr/src/linux-headers-5.14.0-1-common/include -I./include -I/usr/src/linux-headers-5.14.0-1-common/arch/x86/include/uapi -I./arch/x86/include/generated/uapi -I/usr/src/linux-headers-5.14.0-1-common/include/uapi -I./include/generated/uapi -include /usr/src/linux-headers-5.14.0-1-common/include/linux/compiler-version.h -include /usr/src/linux-headers-5.14.0-1-common/include/linux/kconfig.h -include /usr/src/linux-headers-5.14.0-1-common/include/linux/compiler_types.h -D__KERNEL__ -fmacro-prefix-map=/usr/src/linux-headers-5.14.0-1-common/= -Wall -Wundef -Werror=strict-prototypes -Wno-trigraphs -fno-strict-aliasing -fno-common -fshort-wchar -fno-PIE -Werror=implicit-function-declaration -Werror=implicit-int -Werror=return-type -Wno-format-security -std=gnu89 -mno-sse -mno-mmx -mno-sse2 -mno-3dnow -mno-avx -fcf-protection=none -m64 -falign-jumps=1 -falign-loops=1 -mno-80387 -mno-fp-ret-in-387 -mpreferred-stack-boundary=3 -mskip-rax-setup -mtune=generic -mno-red-zone -mcmodel=kernel -DCONFIG_X86_X32_ABI -Wno-sign-compare -fno-asynchronous-unwind-tables -mindirect-branch=thunk-extern -mindirect-branch-register -fno-jump-tables -fno-delete-null-pointer-checks -Wno-frame-address -Wno-format-truncation -Wno-format-overflow -Wno-address-of-packed-member -O2 -fno-allow-store-data-races -Wframe-larger-than=2048 -fstack-protector-strong -Wimplicit-fallthrough=5 -Wno-main -Wno-unused-but-set-variable -Wno-unused-const-variable -fno-stack-clash-protection -g -pg -mrecord-mcount -mfentry -DCC_USING_FENTRY -Wdeclaration-after-statement -Wvla -Wno-pointer-sign -Wno-stringop-truncation -Wno-zero-length-bounds -Wno-array-bounds -Wno-stringop-overflow -Wno-restrict -Wno-maybe-uninitialized -fno-strict-overflow -fno-stack-check -fconserve-stack -Werror=date-time -Werror=incompatible-pointer-types -Werror=designated-init -Wno-packed-not-aligned -I/var/lib/dkms/nvidia-current/470.57.02/build/common/inc -I/var/lib/dkms/nvidia-current/470.57.02/build -Wall -MD -Wno-cast-qual -Wno-error -Wno-format-extra-args -D__KERNEL__ -DMODULE -DNVRM -DNV_VERSION_STRING=\"470.57.02\" -Wno-unused-function -Wuninitialized -fno-strict-aliasing -mno-red-zone -mcmodel=kernel -DNV_UVM_ENABLE -Werror=undef -DNV_SPECTRE_V2=0 -DNV_KERNEL_INTERFACE_LAYER -I/var/lib/dkms/nvidia-current/470.57.02/build/nvidia -DNVIDIA_UNDEF_LEGACY_BIT_MACROS -UDEBUG -U_DEBUG -DNDEBUG  -DMODULE  -DKBUILD_BASENAME='"nv_usermap"' -DKBUILD_MODNAME='"nvidia"' -D__KBUILD_MODNAME=kmod_nvidia -c -o /var/lib/dkms/nvidia-current/470.57.02/build/nvidia/nv-usermap.o /var/lib/dkms/nvidia-current/470.57.02/build/nvidia/nv-usermap.c
   gcc-10 -Wp,-MMD,/var/lib/dkms/nvidia-current/470.57.02/build/nvidia/.nv-vm.o.d -nostdinc -isystem /usr/lib/gcc/x86_64-linux-gnu/10/include -I/usr/src/linux-headers-5.14.0-1-common/arch/x86/include -I./arch/x86/include/generated -I/usr/src/linux-headers-5.14.0-1-common/include -I./include -I/usr/src/linux-headers-5.14.0-1-common/arch/x86/include/uapi -I./arch/x86/include/generated/uapi -I/usr/src/linux-headers-5.14.0-1-common/include/uapi -I./include/generated/uapi -include /usr/src/linux-headers-5.14.0-1-common/include/linux/compiler-version.h -include /usr/src/linux-headers-5.14.0-1-common/include/linux/kconfig.h -include /usr/src/linux-headers-5.14.0-1-common/include/linux/compiler_types.h -D__KERNEL__ -fmacro-prefix-map=/usr/src/linux-headers-5.14.0-1-common/= -Wall -Wundef -Werror=strict-prototypes -Wno-trigraphs -fno-strict-aliasing -fno-common -fshort-wchar -fno-PIE -Werror=implicit-function-declaration -Werror=implicit-int -Werror=return-type -Wno-format-security -std=gnu89 -mno-sse -mno-mmx -mno-sse2 -mno-3dnow -mno-avx -fcf-protection=none -m64 -falign-jumps=1 -falign-loops=1 -mno-80387 -mno-fp-ret-in-387 -mpreferred-stack-boundary=3 -mskip-rax-setup -mtune=generic -mno-red-zone -mcmodel=kernel -DCONFIG_X86_X32_ABI -Wno-sign-compare -fno-asynchronous-unwind-tables -mindirect-branch=thunk-extern -mindirect-branch-register -fno-jump-tables -fno-delete-null-pointer-checks -Wno-frame-address -Wno-format-truncation -Wno-format-overflow -Wno-address-of-packed-member -O2 -fno-allow-store-data-races -Wframe-larger-than=2048 -fstack-protector-strong -Wimplicit-fallthrough=5 -Wno-main -Wno-unused-but-set-variable -Wno-unused-const-variable -fno-stack-clash-protection -g -pg -mrecord-mcount -mfentry -DCC_USING_FENTRY -Wdeclaration-after-statement -Wvla -Wno-pointer-sign -Wno-stringop-truncation -Wno-zero-length-bounds -Wno-array-bounds -Wno-stringop-overflow -Wno-restrict -Wno-maybe-uninitialized -fno-strict-overflow -fno-stack-check -fconserve-stack -Werror=date-time -Werror=incompatible-pointer-types -Werror=designated-init -Wno-packed-not-aligned -I/var/lib/dkms/nvidia-current/470.57.02/build/common/inc -I/var/lib/dkms/nvidia-current/470.57.02/build -Wall -MD -Wno-cast-qual -Wno-error -Wno-format-extra-args -D__KERNEL__ -DMODULE -DNVRM -DNV_VERSION_STRING=\"470.57.02\" -Wno-unused-function -Wuninitialized -fno-strict-aliasing -mno-red-zone -mcmodel=kernel -DNV_UVM_ENABLE -Werror=undef -DNV_SPECTRE_V2=0 -DNV_KERNEL_INTERFACE_LAYER -I/var/lib/dkms/nvidia-current/470.57.02/build/nvidia -DNVIDIA_UNDEF_LEGACY_BIT_MACROS -UDEBUG -U_DEBUG -DNDEBUG  -DMODULE  -DKBUILD_BASENAME='"nv_vm"' -DKBUILD_MODNAME='"nvidia"' -D__KBUILD_MODNAME=kmod_nvidia -c -o /var/lib/dkms/nvidia-current/470.57.02/build/nvidia/nv-vm.o /var/lib/dkms/nvidia-current/470.57.02/build/nvidia/nv-vm.c
   gcc-10 -Wp,-MMD,/var/lib/dkms/nvidia-current/470.57.02/build/nvidia/.nv-vtophys.o.d -nostdinc -isystem /usr/lib/gcc/x86_64-linux-gnu/10/include -I/usr/src/linux-headers-5.14.0-1-common/arch/x86/include -I./arch/x86/include/generated -I/usr/src/linux-headers-5.14.0-1-common/include -I./include -I/usr/src/linux-headers-5.14.0-1-common/arch/x86/include/uapi -I./arch/x86/include/generated/uapi -I/usr/src/linux-headers-5.14.0-1-common/include/uapi -I./include/generated/uapi -include /usr/src/linux-headers-5.14.0-1-common/include/linux/compiler-version.h -include /usr/src/linux-headers-5.14.0-1-common/include/linux/kconfig.h -include /usr/src/linux-headers-5.14.0-1-common/include/linux/compiler_types.h -D__KERNEL__ -fmacro-prefix-map=/usr/src/linux-headers-5.14.0-1-common/= -Wall -Wundef -Werror=strict-prototypes -Wno-trigraphs -fno-strict-aliasing -fno-common -fshort-wchar -fno-PIE -Werror=implicit-function-declaration -Werror=implicit-int -Werror=return-type -Wno-format-security -std=gnu89 -mno-sse -mno-mmx -mno-sse2 -mno-3dnow -mno-avx -fcf-protection=none -m64 -falign-jumps=1 -falign-loops=1 -mno-80387 -mno-fp-ret-in-387 -mpreferred-stack-boundary=3 -mskip-rax-setup -mtune=generic -mno-red-zone -mcmodel=kernel -DCONFIG_X86_X32_ABI -Wno-sign-compare -fno-asynchronous-unwind-tables -mindirect-branch=thunk-extern -mindirect-branch-register -fno-jump-tables -fno-delete-null-pointer-checks -Wno-frame-address -Wno-format-truncation -Wno-format-overflow -Wno-address-of-packed-member -O2 -fno-allow-store-data-races -Wframe-larger-than=2048 -fstack-protector-strong -Wimplicit-fallthrough=5 -Wno-main -Wno-unused-but-set-variable -Wno-unused-const-variable -fno-stack-clash-protection -g -pg -mrecord-mcount -mfentry -DCC_USING_FENTRY -Wdeclaration-after-statement -Wvla -Wno-pointer-sign -Wno-stringop-truncation -Wno-zero-length-bounds -Wno-array-bounds -Wno-stringop-overflow -Wno-restrict -Wno-maybe-uninitialized -fno-strict-overflow -fno-stack-check -fconserve-stack -Werror=date-time -Werror=incompatible-pointer-types -Werror=designated-init -Wno-packed-not-aligned -I/var/lib/dkms/nvidia-current/470.57.02/build/common/inc -I/var/lib/dkms/nvidia-current/470.57.02/build -Wall -MD -Wno-cast-qual -Wno-error -Wno-format-extra-args -D__KERNEL__ -DMODULE -DNVRM -DNV_VERSION_STRING=\"470.57.02\" -Wno-unused-function -Wuninitialized -fno-strict-aliasing -mno-red-zone -mcmodel=kernel -DNV_UVM_ENABLE -Werror=undef -DNV_SPECTRE_V2=0 -DNV_KERNEL_INTERFACE_LAYER -I/var/lib/dkms/nvidia-current/470.57.02/build/nvidia -DNVIDIA_UNDEF_LEGACY_BIT_MACROS -UDEBUG -U_DEBUG -DNDEBUG  -DMODULE  -DKBUILD_BASENAME='"nv_vtophys"' -DKBUILD_MODNAME='"nvidia"' -D__KBUILD_MODNAME=kmod_nvidia -c -o /var/lib/dkms/nvidia-current/470.57.02/build/nvidia/nv-vtophys.o /var/lib/dkms/nvidia-current/470.57.02/build/nvidia/nv-vtophys.c
   gcc-10 -Wp,-MMD,/var/lib/dkms/nvidia-current/470.57.02/build/nvidia/.os-interface.o.d -nostdinc -isystem /usr/lib/gcc/x86_64-linux-gnu/10/include -I/usr/src/linux-headers-5.14.0-1-common/arch/x86/include -I./arch/x86/include/generated -I/usr/src/linux-headers-5.14.0-1-common/include -I./include -I/usr/src/linux-headers-5.14.0-1-common/arch/x86/include/uapi -I./arch/x86/include/generated/uapi -I/usr/src/linux-headers-5.14.0-1-common/include/uapi -I./include/generated/uapi -include /usr/src/linux-headers-5.14.0-1-common/include/linux/compiler-version.h -include /usr/src/linux-headers-5.14.0-1-common/include/linux/kconfig.h -include /usr/src/linux-headers-5.14.0-1-common/include/linux/compiler_types.h -D__KERNEL__ -fmacro-prefix-map=/usr/src/linux-headers-5.14.0-1-common/= -Wall -Wundef -Werror=strict-prototypes -Wno-trigraphs -fno-strict-aliasing -fno-common -fshort-wchar -fno-PIE -Werror=implicit-function-declaration -Werror=implicit-int -Werror=return-type -Wno-format-security -std=gnu89 -mno-sse -mno-mmx -mno-sse2 -mno-3dnow -mno-avx -fcf-protection=none -m64 -falign-jumps=1 -falign-loops=1 -mno-80387 -mno-fp-ret-in-387 -mpreferred-stack-boundary=3 -mskip-rax-setup -mtune=generic -mno-red-zone -mcmodel=kernel -DCONFIG_X86_X32_ABI -Wno-sign-compare -fno-asynchronous-unwind-tables -mindirect-branch=thunk-extern -mindirect-branch-register -fno-jump-tables -fno-delete-null-pointer-checks -Wno-frame-address -Wno-format-truncation -Wno-format-overflow -Wno-address-of-packed-member -O2 -fno-allow-store-data-races -Wframe-larger-than=2048 -fstack-protector-strong -Wimplicit-fallthrough=5 -Wno-main -Wno-unused-but-set-variable -Wno-unused-const-variable -fno-stack-clash-protection -g -pg -mrecord-mcount -mfentry -DCC_USING_FENTRY -Wdeclaration-after-statement -Wvla -Wno-pointer-sign -Wno-stringop-truncation -Wno-zero-length-bounds -Wno-array-bounds -Wno-stringop-overflow -Wno-restrict -Wno-maybe-uninitialized -fno-strict-overflow -fno-stack-check -fconserve-stack -Werror=date-time -Werror=incompatible-pointer-types -Werror=designated-init -Wno-packed-not-aligned -I/var/lib/dkms/nvidia-current/470.57.02/build/common/inc -I/var/lib/dkms/nvidia-current/470.57.02/build -Wall -MD -Wno-cast-qual -Wno-error -Wno-format-extra-args -D__KERNEL__ -DMODULE -DNVRM -DNV_VERSION_STRING=\"470.57.02\" -Wno-unused-function -Wuninitialized -fno-strict-aliasing -mno-red-zone -mcmodel=kernel -DNV_UVM_ENABLE -Werror=undef -DNV_SPECTRE_V2=0 -DNV_KERNEL_INTERFACE_LAYER -I/var/lib/dkms/nvidia-current/470.57.02/build/nvidia -DNVIDIA_UNDEF_LEGACY_BIT_MACROS -UDEBUG -U_DEBUG -DNDEBUG  -DMODULE  -DKBUILD_BASENAME='"os_interface"' -DKBUILD_MODNAME='"nvidia"' -D__KBUILD_MODNAME=kmod_nvidia -c -o /var/lib/dkms/nvidia-current/470.57.02/build/nvidia/os-interface.o /var/lib/dkms/nvidia-current/470.57.02/build/nvidia/os-interface.c
   gcc-10 -Wp,-MMD,/var/lib/dkms/nvidia-current/470.57.02/build/nvidia/.os-mlock.o.d -nostdinc -isystem /usr/lib/gcc/x86_64-linux-gnu/10/include -I/usr/src/linux-headers-5.14.0-1-common/arch/x86/include -I./arch/x86/include/generated -I/usr/src/linux-headers-5.14.0-1-common/include -I./include -I/usr/src/linux-headers-5.14.0-1-common/arch/x86/include/uapi -I./arch/x86/include/generated/uapi -I/usr/src/linux-headers-5.14.0-1-common/include/uapi -I./include/generated/uapi -include /usr/src/linux-headers-5.14.0-1-common/include/linux/compiler-version.h -include /usr/src/linux-headers-5.14.0-1-common/include/linux/kconfig.h -include /usr/src/linux-headers-5.14.0-1-common/include/linux/compiler_types.h -D__KERNEL__ -fmacro-prefix-map=/usr/src/linux-headers-5.14.0-1-common/= -Wall -Wundef -Werror=strict-prototypes -Wno-trigraphs -fno-strict-aliasing -fno-common -fshort-wchar -fno-PIE -Werror=implicit-function-declaration -Werror=implicit-int -Werror=return-type -Wno-format-security -std=gnu89 -mno-sse -mno-mmx -mno-sse2 -mno-3dnow -mno-avx -fcf-protection=none -m64 -falign-jumps=1 -falign-loops=1 -mno-80387 -mno-fp-ret-in-387 -mpreferred-stack-boundary=3 -mskip-rax-setup -mtune=generic -mno-red-zone -mcmodel=kernel -DCONFIG_X86_X32_ABI -Wno-sign-compare -fno-asynchronous-unwind-tables -mindirect-branch=thunk-extern -mindirect-branch-register -fno-jump-tables -fno-delete-null-pointer-checks -Wno-frame-address -Wno-format-truncation -Wno-format-overflow -Wno-address-of-packed-member -O2 -fno-allow-store-data-races -Wframe-larger-than=2048 -fstack-protector-strong -Wimplicit-fallthrough=5 -Wno-main -Wno-unused-but-set-variable -Wno-unused-const-variable -fno-stack-clash-protection -g -pg -mrecord-mcount -mfentry -DCC_USING_FENTRY -Wdeclaration-after-statement -Wvla -Wno-pointer-sign -Wno-stringop-truncation -Wno-zero-length-bounds -Wno-array-bounds -Wno-stringop-overflow -Wno-restrict -Wno-maybe-uninitialized -fno-strict-overflow -fno-stack-check -fconserve-stack -Werror=date-time -Werror=incompatible-pointer-types -Werror=designated-init -Wno-packed-not-aligned -I/var/lib/dkms/nvidia-current/470.57.02/build/common/inc -I/var/lib/dkms/nvidia-current/470.57.02/build -Wall -MD -Wno-cast-qual -Wno-error -Wno-format-extra-args -D__KERNEL__ -DMODULE -DNVRM -DNV_VERSION_STRING=\"470.57.02\" -Wno-unused-function -Wuninitialized -fno-strict-aliasing -mno-red-zone -mcmodel=kernel -DNV_UVM_ENABLE -Werror=undef -DNV_SPECTRE_V2=0 -DNV_KERNEL_INTERFACE_LAYER -I/var/lib/dkms/nvidia-current/470.57.02/build/nvidia -DNVIDIA_UNDEF_LEGACY_BIT_MACROS -UDEBUG -U_DEBUG -DNDEBUG  -DMODULE  -DKBUILD_BASENAME='"os_mlock"' -DKBUILD_MODNAME='"nvidia"' -D__KBUILD_MODNAME=kmod_nvidia -c -o /var/lib/dkms/nvidia-current/470.57.02/build/nvidia/os-mlock.o /var/lib/dkms/nvidia-current/470.57.02/build/nvidia/os-mlock.c
   ./tools/objtool/objtool orc generate  --module  --no-fp   --retpoline  --uaccess  /var/lib/dkms/nvidia-current/470.57.02/build/nvidia/nv-procfs-utils.o
In file included from /var/lib/dkms/nvidia-current/470.57.02/build/common/inc/nv-linux.h:25,
                 from /var/lib/dkms/nvidia-current/470.57.02/build/nvidia/nv-cray.c:14:
/var/lib/dkms/nvidia-current/470.57.02/build/common/inc/nv-time.h: In function ‘nv_sleep_ms’:
/var/lib/dkms/nvidia-current/470.57.02/build/common/inc/nv-time.h:217:18: error: ‘struct task_struct’ has no member named ‘state’; did you mean ‘__state’?
  217 |         current->state = TASK_INTERRUPTIBLE;
      |                  ^~~~~
      |                  __state
  if objdump -h /var/lib/dkms/nvidia-current/470.57.02/build/nvidia/nv-procfs-utils.o | grep -q __ksymtab; then  gcc-10 -E -D__GENKSYMS__ -Wp,-MMD,/var/lib/dkms/nvidia-current/470.57.02/build/nvidia/.nv-procfs-utils.o.d -nostdinc -isystem /usr/lib/gcc/x86_64-linux-gnu/10/include -I/usr/src/linux-headers-5.14.0-1-common/arch/x86/include -I./arch/x86/include/generated -I/usr/src/linux-headers-5.14.0-1-common/include -I./include -I/usr/src/linux-headers-5.14.0-1-common/arch/x86/include/uapi -I./arch/x86/include/generated/uapi -I/usr/src/linux-headers-5.14.0-1-common/include/uapi -I./include/generated/uapi -include /usr/src/linux-headers-5.14.0-1-common/include/linux/compiler-version.h -include /usr/src/linux-headers-5.14.0-1-common/include/linux/kconfig.h -include /usr/src/linux-headers-5.14.0-1-common/include/linux/compiler_types.h -D__KERNEL__ -fmacro-prefix-map=/usr/src/linux-headers-5.14.0-1-common/= -Wall -Wundef -Werror=strict-prototypes -Wno-trigraphs -fno-strict-aliasing -fno-common -fshort-wchar -fno-PIE -Werror=implicit-function-declaration -Werror=implicit-int -Werror=return-type -Wno-format-security -std=gnu89 -mno-sse -mno-mmx -mno-sse2 -mno-3dnow -mno-avx -fcf-protection=none -m64 -falign-jumps=1 -falign-loops=1 -mno-80387 -mno-fp-ret-in-387 -mpreferred-stack-boundary=3 -mskip-rax-setup -mtune=generic -mno-red-zone -mcmodel=kernel -DCONFIG_X86_X32_ABI -Wno-sign-compare -fno-asynchronous-unwind-tables -mindirect-branch=thunk-extern -mindirect-branch-register -fno-jump-tables -fno-delete-null-pointer-checks -Wno-frame-address -Wno-format-truncation -Wno-format-overflow -Wno-address-of-packed-member -O2 -fno-allow-store-data-races -Wframe-larger-than=2048 -fstack-protector-strong -Wimplicit-fallthrough=5 -Wno-main -Wno-unused-but-set-variable -Wno-unused-const-variable -fno-stack-clash-protection -g -pg -mrecord-mcount -mfentry -DCC_USING_FENTRY -Wdeclaration-after-statement -Wvla -Wno-pointer-sign -Wno-stringop-truncation -Wno-zero-length-bounds -Wno-array-bounds -Wno-stringop-overflow -Wno-restrict -Wno-maybe-uninitialized -fno-strict-overflow -fno-stack-check -fconserve-stack -Werror=date-time -Werror=incompatible-pointer-types -Werror=designated-init -Wno-packed-not-aligned -I/var/lib/dkms/nvidia-current/470.57.02/build/common/inc -I/var/lib/dkms/nvidia-current/470.57.02/build -Wall -MD -Wno-cast-qual -Wno-error -Wno-format-extra-args -D__KERNEL__ -DMODULE -DNVRM -DNV_VERSION_STRING=\"470.57.02\" -Wno-unused-function -Wuninitialized -fno-strict-aliasing -mno-red-zone -mcmodel=kernel -DNV_UVM_ENABLE -Werror=undef -DNV_SPECTRE_V2=0 -DNV_KERNEL_INTERFACE_LAYER -I/var/lib/dkms/nvidia-current/470.57.02/build/nvidia -DNVIDIA_UNDEF_LEGACY_BIT_MACROS -UDEBUG -U_DEBUG -DNDEBUG  -DMODULE  -DKBUILD_BASENAME='"nv_procfs_utils"' -DKBUILD_MODNAME='"nvidia"' -D__KBUILD_MODNAME=kmod_nvidia /var/lib/dkms/nvidia-current/470.57.02/build/nvidia/nv-procfs-utils.c | scripts/genksyms/genksyms    -r /dev/null > /var/lib/dkms/nvidia-current/470.57.02/build/nvidia/.tmp_nv-procfs-utils.ver; ld -m elf_x86_64 -r -o /var/lib/dkms/nvidia-current/470.57.02/build/nvidia/.tmp_nv-procfs-utils.o /var/lib/dkms/nvidia-current/470.57.02/build/nvidia/nv-procfs-utils.o -T /var/lib/dkms/nvidia-current/470.57.02/build/nvidia/.tmp_nv-procfs-utils.ver; mv -f /var/lib/dkms/nvidia-current/470.57.02/build/nvidia/.tmp_nv-procfs-utils.o /var/lib/dkms/nvidia-current/470.57.02/build/nvidia/nv-procfs-utils.o; rm -f /var/lib/dkms/nvidia-current/470.57.02/build/nvidia/.tmp_nv-procfs-utils.ver; fi
In file included from /var/lib/dkms/nvidia-current/470.57.02/build/common/inc/nv-linux.h:25,
                 from /var/lib/dkms/nvidia-current/470.57.02/build/nvidia/nv.c:13:
/var/lib/dkms/nvidia-current/470.57.02/build/common/inc/nv-time.h: In function ‘nv_sleep_ms’:
/var/lib/dkms/nvidia-current/470.57.02/build/common/inc/nv-time.h:217:18: error: ‘struct task_struct’ has no member named ‘state’; did you mean ‘__state’?
  217 |         current->state = TASK_INTERRUPTIBLE;
      |                  ^~~~~
      |                  __state
   gcc-10 -Wp,-MMD,/var/lib/dkms/nvidia-current/470.57.02/build/nvidia/.os-pci.o.d -nostdinc -isystem /usr/lib/gcc/x86_64-linux-gnu/10/include -I/usr/src/linux-headers-5.14.0-1-common/arch/x86/include -I./arch/x86/include/generated -I/usr/src/linux-headers-5.14.0-1-common/include -I./include -I/usr/src/linux-headers-5.14.0-1-common/arch/x86/include/uapi -I./arch/x86/include/generated/uapi -I/usr/src/linux-headers-5.14.0-1-common/include/uapi -I./include/generated/uapi -include /usr/src/linux-headers-5.14.0-1-common/include/linux/compiler-version.h -include /usr/src/linux-headers-5.14.0-1-common/include/linux/kconfig.h -include /usr/src/linux-headers-5.14.0-1-common/include/linux/compiler_types.h -D__KERNEL__ -fmacro-prefix-map=/usr/src/linux-headers-5.14.0-1-common/= -Wall -Wundef -Werror=strict-prototypes -Wno-trigraphs -fno-strict-aliasing -fno-common -fshort-wchar -fno-PIE -Werror=implicit-function-declaration -Werror=implicit-int -Werror=return-type -Wno-format-security -std=gnu89 -mno-sse -mno-mmx -mno-sse2 -mno-3dnow -mno-avx -fcf-protection=none -m64 -falign-jumps=1 -falign-loops=1 -mno-80387 -mno-fp-ret-in-387 -mpreferred-stack-boundary=3 -mskip-rax-setup -mtune=generic -mno-red-zone -mcmodel=kernel -DCONFIG_X86_X32_ABI -Wno-sign-compare -fno-asynchronous-unwind-tables -mindirect-branch=thunk-extern -mindirect-branch-register -fno-jump-tables -fno-delete-null-pointer-checks -Wno-frame-address -Wno-format-truncation -Wno-format-overflow -Wno-address-of-packed-member -O2 -fno-allow-store-data-races -Wframe-larger-than=2048 -fstack-protector-strong -Wimplicit-fallthrough=5 -Wno-main -Wno-unused-but-set-variable -Wno-unused-const-variable -fno-stack-clash-protection -g -pg -mrecord-mcount -mfentry -DCC_USING_FENTRY -Wdeclaration-after-statement -Wvla -Wno-pointer-sign -Wno-stringop-truncation -Wno-zero-length-bounds -Wno-array-bounds -Wno-stringop-overflow -Wno-restrict -Wno-maybe-uninitialized -fno-strict-overflow -fno-stack-check -fconserve-stack -Werror=date-time -Werror=incompatible-pointer-types -Werror=designated-init -Wno-packed-not-aligned -I/var/lib/dkms/nvidia-current/470.57.02/build/common/inc -I/var/lib/dkms/nvidia-current/470.57.02/build -Wall -MD -Wno-cast-qual -Wno-error -Wno-format-extra-args -D__KERNEL__ -DMODULE -DNVRM -DNV_VERSION_STRING=\"470.57.02\" -Wno-unused-function -Wuninitialized -fno-strict-aliasing -mno-red-zone -mcmodel=kernel -DNV_UVM_ENABLE -Werror=undef -DNV_SPECTRE_V2=0 -DNV_KERNEL_INTERFACE_LAYER -I/var/lib/dkms/nvidia-current/470.57.02/build/nvidia -DNVIDIA_UNDEF_LEGACY_BIT_MACROS -UDEBUG -U_DEBUG -DNDEBUG  -DMODULE  -DKBUILD_BASENAME='"os_pci"' -DKBUILD_MODNAME='"nvidia"' -D__KBUILD_MODNAME=kmod_nvidia -c -o /var/lib/dkms/nvidia-current/470.57.02/build/nvidia/os-pci.o /var/lib/dkms/nvidia-current/470.57.02/build/nvidia/os-pci.c
In file included from /var/lib/dkms/nvidia-current/470.57.02/build/common/inc/nv-linux.h:25,
                 from /var/lib/dkms/nvidia-current/470.57.02/build/nvidia/nv-dma.c:14:
/var/lib/dkms/nvidia-current/470.57.02/build/common/inc/nv-time.h: In function ‘nv_sleep_ms’:
/var/lib/dkms/nvidia-current/470.57.02/build/common/inc/nv-time.h:217:18: error: ‘struct task_struct’ has no member named ‘state’; did you mean ‘__state’?
  217 |         current->state = TASK_INTERRUPTIBLE;
      |                  ^~~~~
      |                  __state
In file included from /var/lib/dkms/nvidia-current/470.57.02/build/common/inc/nv-linux.h:25,
                 from /var/lib/dkms/nvidia-current/470.57.02/build/nvidia/nv-acpi.c:14:
/var/lib/dkms/nvidia-current/470.57.02/build/common/inc/nv-time.h: In function ‘nv_sleep_ms’:
/var/lib/dkms/nvidia-current/470.57.02/build/common/inc/nv-time.h:217:18: error: ‘struct task_struct’ has no member named ‘state’; did you mean ‘__state’?
  217 |         current->state = TASK_INTERRUPTIBLE;
      |                  ^~~~~
      |                  __state
In file included from /var/lib/dkms/nvidia-current/470.57.02/build/common/inc/nv-linux.h:25,
                 from /var/lib/dkms/nvidia-current/470.57.02/build/nvidia/nv-mmap.c:14:
/var/lib/dkms/nvidia-current/470.57.02/build/common/inc/nv-time.h: In function ‘nv_sleep_ms’:
/var/lib/dkms/nvidia-current/470.57.02/build/common/inc/nv-time.h:217:18: error: ‘struct task_struct’ has no member named ‘state’; did you mean ‘__state’?
  217 |         current->state = TASK_INTERRUPTIBLE;
      |                  ^~~~~
      |                  __state
In file included from /var/lib/dkms/nvidia-current/470.57.02/build/common/inc/nv-linux.h:25,
                 from /var/lib/dkms/nvidia-current/470.57.02/build/nvidia/nv-procfs.c:14:
/var/lib/dkms/nvidia-current/470.57.02/build/common/inc/nv-time.h: In function ‘nv_sleep_ms’:
/var/lib/dkms/nvidia-current/470.57.02/build/common/inc/nv-time.h:217:18: error: ‘struct task_struct’ has no member named ‘state’; did you mean ‘__state’?
  217 |         current->state = TASK_INTERRUPTIBLE;
      |                  ^~~~~
      |                  __state
In file included from /var/lib/dkms/nvidia-current/470.57.02/build/common/inc/nv-linux.h:25,
                 from /var/lib/dkms/nvidia-current/470.57.02/build/nvidia/nv-p2p.c:14:
/var/lib/dkms/nvidia-current/470.57.02/build/common/inc/nv-time.h: In function ‘nv_sleep_ms’:
/var/lib/dkms/nvidia-current/470.57.02/build/common/inc/nv-time.h:217:18: error: ‘struct task_struct’ has no member named ‘state’; did you mean ‘__state’?
  217 |         current->state = TASK_INTERRUPTIBLE;
      |                  ^~~~~
      |                  __state
In file included from /var/lib/dkms/nvidia-current/470.57.02/build/common/inc/nv-linux.h:25,
                 from /var/lib/dkms/nvidia-current/470.57.02/build/nvidia/nv-pat.c:14:
/var/lib/dkms/nvidia-current/470.57.02/build/common/inc/nv-time.h: In function ‘nv_sleep_ms’:
/var/lib/dkms/nvidia-current/470.57.02/build/common/inc/nv-time.h:217:18: error: ‘struct task_struct’ has no member named ‘state’; did you mean ‘__state’?
  217 |         current->state = TASK_INTERRUPTIBLE;
      |                  ^~~~~
      |                  __state
In file included from /var/lib/dkms/nvidia-current/470.57.02/build/common/inc/nv-linux.h:25,
                 from /var/lib/dkms/nvidia-current/470.57.02/build/nvidia/nv-usermap.c:14:
/var/lib/dkms/nvidia-current/470.57.02/build/common/inc/nv-time.h: In function ‘nv_sleep_ms’:
/var/lib/dkms/nvidia-current/470.57.02/build/common/inc/nv-time.h:217:18: error: ‘struct task_struct’ has no member named ‘state’; did you mean ‘__state’?
  217 |         current->state = TASK_INTERRUPTIBLE;
      |                  ^~~~~
      |                  __state
In file included from /var/lib/dkms/nvidia-current/470.57.02/build/common/inc/nv-linux.h:25,
                 from /var/lib/dkms/nvidia-current/470.57.02/build/nvidia/nv-vm.c:13:
/var/lib/dkms/nvidia-current/470.57.02/build/common/inc/nv-time.h: In function ‘nv_sleep_ms’:
/var/lib/dkms/nvidia-current/470.57.02/build/common/inc/nv-time.h:217:18: error: ‘struct task_struct’ has no member named ‘state’; did you mean ‘__state’?
  217 |         current->state = TASK_INTERRUPTIBLE;
      |                  ^~~~~
      |                  __state
In file included from /var/lib/dkms/nvidia-current/470.57.02/build/common/inc/nv-linux.h:25,
                 from /var/lib/dkms/nvidia-current/470.57.02/build/nvidia/os-mlock.c:14:
/var/lib/dkms/nvidia-current/470.57.02/build/common/inc/nv-time.h: In function ‘nv_sleep_ms’:
/var/lib/dkms/nvidia-current/470.57.02/build/common/inc/nv-time.h:217:18: error: ‘struct task_struct’ has no member named ‘state’; did you mean ‘__state’?
  217 |         current->state = TASK_INTERRUPTIBLE;
      |                  ^~~~~
      |                  __state
In file included from /var/lib/dkms/nvidia-current/470.57.02/build/common/inc/nv-linux.h:25,
                 from /var/lib/dkms/nvidia-current/470.57.02/build/nvidia/nv-vtophys.c:14:
/var/lib/dkms/nvidia-current/470.57.02/build/common/inc/nv-time.h: In function ‘nv_sleep_ms’:
/var/lib/dkms/nvidia-current/470.57.02/build/common/inc/nv-time.h:217:18: error: ‘struct task_struct’ has no member named ‘state’; did you mean ‘__state’?
  217 |         current->state = TASK_INTERRUPTIBLE;
      |                  ^~~~~
      |                  __state
In file included from /var/lib/dkms/nvidia-current/470.57.02/build/common/inc/nv-linux.h:25,
                 from /var/lib/dkms/nvidia-current/470.57.02/build/nvidia/os-interface.c:14:
/var/lib/dkms/nvidia-current/470.57.02/build/common/inc/nv-time.h: In function ‘nv_sleep_ms’:
/var/lib/dkms/nvidia-current/470.57.02/build/common/inc/nv-time.h:217:18: error: ‘struct task_struct’ has no member named ‘state’; did you mean ‘__state’?
  217 |         current->state = TASK_INTERRUPTIBLE;
      |                  ^~~~~
      |                  __state
In file included from /var/lib/dkms/nvidia-current/470.57.02/build/common/inc/nv-linux.h:25,
                 from /var/lib/dkms/nvidia-current/470.57.02/build/common/inc/nv-pci.h:15,
                 from /var/lib/dkms/nvidia-current/470.57.02/build/nvidia/nv-pci.c:13:
/var/lib/dkms/nvidia-current/470.57.02/build/common/inc/nv-time.h: In function ‘nv_sleep_ms’:
/var/lib/dkms/nvidia-current/470.57.02/build/common/inc/nv-time.h:217:18: error: ‘struct task_struct’ has no member named ‘state’; did you mean ‘__state’?
  217 |         current->state = TASK_INTERRUPTIBLE;
      |                  ^~~~~
      |                  __state
In file included from /var/lib/dkms/nvidia-current/470.57.02/build/common/inc/nv-linux.h:25,
                 from /var/lib/dkms/nvidia-current/470.57.02/build/nvidia/nv-i2c.c:16:
/var/lib/dkms/nvidia-current/470.57.02/build/common/inc/nv-time.h: In function ‘nv_sleep_ms’:
/var/lib/dkms/nvidia-current/470.57.02/build/common/inc/nv-time.h:217:18: error: ‘struct task_struct’ has no member named ‘state’; did you mean ‘__state’?
  217 |         current->state = TASK_INTERRUPTIBLE;
      |                  ^~~~~
      |                  __state
make[3]: *** [/usr/src/linux-headers-5.14.0-1-common/scripts/Makefile.build:276 : /var/lib/dkms/nvidia-current/470.57.02/build/nvidia/nv-cray.o] Erreur 1
make[3]: *** Attente des tâches non terminées....
/var/lib/dkms/nvidia-current/470.57.02/build/nvidia/nv-dma.c: At top level:
/var/lib/dkms/nvidia-current/470.57.02/build/nvidia/nv-dma.c:963: warning: "IMPORT_SGT_STUBS_NEEDED" redefined
  963 | #define IMPORT_SGT_STUBS_NEEDED 0
      |
/var/lib/dkms/nvidia-current/470.57.02/build/nvidia/nv-dma.c:957: note: this is the location of the previous definition
  957 | #define IMPORT_SGT_STUBS_NEEDED 1
      |
make[3]: *** [/usr/src/linux-headers-5.14.0-1-common/scripts/Makefile.build:276 : /var/lib/dkms/nvidia-current/470.57.02/build/nvidia/nv-dma.o] Erreur 1
/var/lib/dkms/nvidia-current/470.57.02/build/nvidia/nv-mmap.c: In function ‘nv_encode_caching’:
/var/lib/dkms/nvidia-current/470.57.02/build/nvidia/nv-mmap.c:321:16: warning: this statement may fall through [-Wimplicit-fallthrough=]
  321 |             if (NV_ALLOW_CACHING(memory_type))
      |                ^
/var/lib/dkms/nvidia-current/470.57.02/build/nvidia/nv-mmap.c:324:9: note: here
  324 |         default:
      |         ^~~~~~~
make[3]: *** [/usr/src/linux-headers-5.14.0-1-common/scripts/Makefile.build:276 : /var/lib/dkms/nvidia-current/470.57.02/build/nvidia/nv-i2c.o] Erreur 1
make[3]: *** [/usr/src/linux-headers-5.14.0-1-common/scripts/Makefile.build:276 : /var/lib/dkms/nvidia-current/470.57.02/build/nvidia/nv-acpi.o] Erreur 1
make[3]: *** [/usr/src/linux-headers-5.14.0-1-common/scripts/Makefile.build:276 : /var/lib/dkms/nvidia-current/470.57.02/build/nvidia/nv-mmap.o] Erreur 1
make[3]: *** [/usr/src/linux-headers-5.14.0-1-common/scripts/Makefile.build:276 : /var/lib/dkms/nvidia-current/470.57.02/build/nvidia/nv-usermap.o] Erreur 1
make[3]: *** [/usr/src/linux-headers-5.14.0-1-common/scripts/Makefile.build:276 : /var/lib/dkms/nvidia-current/470.57.02/build/nvidia/nv-pat.o] Erreur 1
make[3]: *** [/usr/src/linux-headers-5.14.0-1-common/scripts/Makefile.build:276 : /var/lib/dkms/nvidia-current/470.57.02/build/nvidia/os-mlock.o] Erreur 1
make[3]: *** [/usr/src/linux-headers-5.14.0-1-common/scripts/Makefile.build:276 : /var/lib/dkms/nvidia-current/470.57.02/build/nvidia/nv-vm.o] Erreur 1
make[3]: *** [/usr/src/linux-headers-5.14.0-1-common/scripts/Makefile.build:276 : /var/lib/dkms/nvidia-current/470.57.02/build/nvidia/nv-procfs.o] Erreur 1
make[3]: *** [/usr/src/linux-headers-5.14.0-1-common/scripts/Makefile.build:276 : /var/lib/dkms/nvidia-current/470.57.02/build/nvidia/nv-p2p.o] Erreur 1
make[3]: *** [/usr/src/linux-headers-5.14.0-1-common/scripts/Makefile.build:276 : /var/lib/dkms/nvidia-current/470.57.02/build/nvidia/nv-vtophys.o] Erreur 1
In file included from /var/lib/dkms/nvidia-current/470.57.02/build/common/inc/nv-linux.h:25,
                 from /var/lib/dkms/nvidia-current/470.57.02/build/nvidia/os-pci.c:14:
/var/lib/dkms/nvidia-current/470.57.02/build/common/inc/nv-time.h: In function ‘nv_sleep_ms’:
/var/lib/dkms/nvidia-current/470.57.02/build/common/inc/nv-time.h:217:18: error: ‘struct task_struct’ has no member named ‘state’; did you mean ‘__state’?
  217 |         current->state = TASK_INTERRUPTIBLE;
      |                  ^~~~~
      |                  __state
make[3]: *** [/usr/src/linux-headers-5.14.0-1-common/scripts/Makefile.build:276 : /var/lib/dkms/nvidia-current/470.57.02/build/nvidia/nv.o] Erreur 1
make[3]: *** [/usr/src/linux-headers-5.14.0-1-common/scripts/Makefile.build:276 : /var/lib/dkms/nvidia-current/470.57.02/build/nvidia/nv-pci.o] Erreur 1
make[3]: *** [/usr/src/linux-headers-5.14.0-1-common/scripts/Makefile.build:276 : /var/lib/dkms/nvidia-current/470.57.02/build/nvidia/os-interface.o] Erreur 1
make[3]: *** [/usr/src/linux-headers-5.14.0-1-common/scripts/Makefile.build:276 : /var/lib/dkms/nvidia-current/470.57.02/build/nvidia/os-pci.o] Erreur 1
make[2]: *** [/usr/src/linux-headers-5.14.0-1-common/Makefile:1882 : /var/lib/dkms/nvidia-current/470.57.02/build] Erreur 2
make[2] : on quitte le répertoire « /usr/src/linux-headers-5.14.0-1-amd64 »
make[1]: *** [Makefile:232 : __sub-make] Erreur 2
make[1] : on quitte le répertoire « /usr/src/linux-headers-5.14.0-1-common »
make: *** [Makefile:80 : modules] Erreur 2



apres je comence a avoir un peut de fievre car je ne voi pas ou peut se situer mon probleme, je ne comprend pas ce qu'il cloche a vrai dire puisque j'ai fais des update des centaine de foid et subitement, meme l'installation devrais etre easy mais plus maintenant avez vous une idée sur ce qu'il cloche ?

merci a vous

Dernière modification par ouatou (28-09-2021 22:03:51)

Hors ligne

#2 28-09-2021 22:10:14

ouatou
Membre
Distrib. : bookworm
Noyau : Linux 5.14.0-1-amd64
(G)UI : gnome
Inscription : 07-11-2014

Re : reinstallation driver graphique compliqué debian testing

sos.gif

Hors ligne

#3 29-09-2021 11:15:36

robert2a
Membre
Inscription : 15-11-2014

Re : reinstallation driver graphique compliqué debian testing

Bonjour

non rien de compliqué , tu a juste peut être un souci avec le noyau + headers de testing
pour commencer le firmware-misc-nonfree ne sert a rien avec le driver nvidia (juste en dépannage le cas ou tu reviens a nouveau)
vérifier que tu a bien deux noyau sur testing (celui de bullseye et celui de testing)
si oui démarrer sur le noyau de bullseye et supprimer celui de testing (image et headers) (supprimer temporaire les méta paquet linux-image-amd64 et linux-headers-amd64 )
bien purger le driver nvidia
vérifier que tu a bien bien image et headers de bullseye
installer le driver


apt install nvidia-driver
 



la version de testing => https://packages.debian.org/fr/bookworm/nvidia-driver

ce qui cloche , ton sources.list est correct ?
je te conseille de garder une référence a bullseye et bookworm comme ceci


deb https://deb.debian.org/debian/ bullseye main contrib non-free
deb-src https://deb.debian.org/debian/ bullseye main contrib non-free
deb https://security.debian.org/debian-security bullseye-security main contrib non-free
deb-src https://security.debian.org/debian-security bullseye-security main contrib non-free
deb https://deb.debian.org/debian/ bullseye-updates main contrib non-free
deb-src https://deb.debian.org/debian/ bullseye-updates main contrib non-free


deb https://deb.debian.org/debian/ bookworm main contrib non-free
deb-src https://deb.debian.org/debian/ bookworm main contrib non-free
deb https://security.debian.org/debian-security bookworm-security main contrib non-free
deb-src https://security.debian.org/debian-security bookworm-security main contrib non-free
deb https://deb.debian.org/debian/ bookworm-updates main contrib non-free
deb-src https://deb.debian.org/debian/ bookworm-updates main contrib non-free
 



que tu pourra supprimer quand le noyau + headers sera correct dans testing

il y a sûrement une incompatibilité entre le noyau + headers et la version du driver
ce que je suis sur c'est que sur bullseye c'est correct (installation du driver hier sur une de mes machines )

ps: il y a beaucoup de soucis sur le noyau actuel de testing et sid (même en driver libre comme AMD)
ça va être résolu avec un peu de patience

donc installer le driver de testing sur le noyau + headers de stable dans un premier temps
si encore des soucis installer le driver de stable sur le le noyau + headers de stable

ne pas faire de mise a jour du noyau + headers et du driver pour l'instant sur testing

ps: je pourrai regarder sur une machine ce qui cloche en testing et nvidia
remarque:
quand le problème est résolu tu pourra supprimer la référence a bullseye dans ton sources.list , la plus part des paquets ont migrer en testing
quand on utilise testing/sid ça arrive parfois ce genre de bug  smile

re,
la machine est prete , bureau mate , gpu GTX750 sur nouveau , debian11 bullseye , je migre en bookworm (testing) et j'installe le driver nvidia
je te donne le résultat  smile
mon sources.list


deb http://deb.debian.org/debian/ bullseye main contrib non-free
deb http://security.debian.org/debian-security bullseye-security main contrib non-free
deb http://deb.debian.org/debian/ bullseye-updates main contrib non-free

#deb http://deb.debian.org/debian/ bookworm main contrib non-free
#deb http://security.debian.org/debian-security bookworm-security main contrib non-free
#deb http://deb.debian.org/debian/ bookworm-updates main contrib non-free
 



je retire les "#" et je lance la migration @+

Dernière modification par robert2a (29-09-2021 12:47:41)

Hors ligne

#4 29-09-2021 13:32:18

robert2a
Membre
Inscription : 15-11-2014

Re : reinstallation driver graphique compliqué debian testing

re,
migration terminé


journalctl -b -r -p err
-- Journal begins at Wed 2021-09-29 13:25:48 CEST, ends at Wed 2021-09-29 13:27:34 CEST. --
sept. 29 13:26:32 debian2 pulseaudio[654]: Error opening PCM device iec958:0: Aucun fichier ou dossier de ce type
sept. 29 13:25:56 debian2 kernel: nouveau 0000:01:00.0: bus: MMIO read of 00000000 FAULT at 3e6684 [ PRIVRING ]
 



uname -a
Linux debian2 5.14.0-1-amd64 #1 SMP Debian 5.14.6-2 (2021-09-19) x86_64 GNU/Linux
 



tu vérifie ceci (installer)


apt policy linux-image-amd64 linux-headers-amd64
linux-image-amd64:
  Installé : 5.14.6-2
  Candidat : 5.14.6-2
 Table de version :
 *** 5.14.6-2 500
        500 http://deb.debian.org/debian bookworm/main amd64 Packages
        100 /var/lib/dpkg/status
     5.10.46-5 500
        500 http://security.debian.org/debian-security bullseye-security/main amd64 Packages
     5.10.46-4 500
        500 http://deb.debian.org/debian bullseye/main amd64 Packages
linux-headers-amd64:
  Installé : 5.14.6-2
  Candidat : 5.14.6-2
 Table de version :
 *** 5.14.6-2 500
        500 http://deb.debian.org/debian bookworm/main amd64 Packages
        100 /var/lib/dpkg/status
     5.10.46-5 500
        500 http://security.debian.org/debian-security bullseye-security/main amd64 Packages
     5.10.46-4 500
        500 http://deb.debian.org/debian bullseye/main amd64 Packages
 


je vais lancer l'installation du driver

Dernière modification par robert2a (29-09-2021 13:38:23)

Hors ligne

#5 29-09-2021 13:52:24

robert2a
Membre
Inscription : 15-11-2014

Re : reinstallation driver graphique compliqué debian testing

re,
et un échec , il y a bien un souci


apt install nvidia-driver
 



Lecture des listes de paquets... Fait
Construction de l'arbre des dépendances... Fait
Lecture des informations d'état... Fait      
Les paquets supplémentaires suivants seront installés :
  dctrl-tools dkms glx-alternative-mesa glx-alternative-nvidia glx-diversions libcuda1 libegl-nvidia0 libgl1-nvidia-glvnd-glx
  libgles-nvidia1 libgles-nvidia2 libgles1 libglx-nvidia0 libnvcuvid1 libnvidia-cbl libnvidia-cfg1 libnvidia-eglcore libnvidia-encode1
  libnvidia-glcore libnvidia-glvkspirv libnvidia-ml1 libnvidia-ptxjitcompiler1 libnvidia-rtcore libopengl0 nvidia-alternative
  nvidia-driver-bin nvidia-driver-libs nvidia-egl-common nvidia-egl-icd nvidia-installer-cleanup nvidia-kernel-common nvidia-kernel-dkms
  nvidia-kernel-support nvidia-legacy-check nvidia-modprobe nvidia-persistenced nvidia-settings nvidia-smi nvidia-support
  nvidia-vdpau-driver nvidia-vulkan-common nvidia-vulkan-icd sudo update-glx xserver-xorg-video-nvidia
Paquets suggérés :
  debtags nvidia-cuda-mps vulkan-utils
Paquets recommandés :
  libcuda1:i386 nvidia-driver-libs:i386
Les NOUVEAUX paquets suivants seront installés :
  dctrl-tools dkms glx-alternative-mesa glx-alternative-nvidia glx-diversions libcuda1 libegl-nvidia0 libgl1-nvidia-glvnd-glx
  libgles-nvidia1 libgles-nvidia2 libgles1 libglx-nvidia0 libnvcuvid1 libnvidia-cbl libnvidia-cfg1 libnvidia-eglcore libnvidia-encode1
  libnvidia-glcore libnvidia-glvkspirv libnvidia-ml1 libnvidia-ptxjitcompiler1 libnvidia-rtcore libopengl0 nvidia-alternative nvidia-driver
  nvidia-driver-bin nvidia-driver-libs nvidia-egl-common nvidia-egl-icd nvidia-installer-cleanup nvidia-kernel-common nvidia-kernel-dkms
  nvidia-kernel-support nvidia-legacy-check nvidia-modprobe nvidia-persistenced nvidia-settings nvidia-smi nvidia-support
  nvidia-vdpau-driver nvidia-vulkan-common nvidia-vulkan-icd sudo update-glx xserver-xorg-video-nvidia
0 mis à jour, 45 nouvellement installés, 0 à enlever et 0 non mis à jour.
Il est nécessaire de prendre 98,0 Mo dans les archives.
Après cette opération, 328 Mo d'espace disque supplémentaires seront utilisés.
Souhaitez-vous continuer ? [O/n]


Récupération des rapports de bogue… Fait
Analyse des informations Trouvé/Corrigé… Fait
bogues de gravité serious sur glx-diversions (→ 1.2.0) <En attente de traitement>
 b1 - #993338 - octave: Setting up octave fails due to missing libGL.so.1
bogues de gravité serious sur nvidia-driver (→ 470.57.02-2) <Résolus dans une version donnée>
 b2 - #994860 - nvidia-driver: Does not build against new kernel 5.14.0-1-amd64 (Corrigé : nvidia-graphics-drivers-tesla-470/470.57.02-2 nvidia-graphics-drivers/470.57.02-3)
Résumé :
 glx-diversions(1 bogue), nvidia-driver(1 bogue)
Êtes-vous certain(e) de vouloir installer/mettre à niveau les paquets ci-dessus ? [Y/n/?/...]


Created symlink /etc/systemd/system/multi-user.target.wants/nvidia-persistenced.service → /lib/systemd/system/nvidia-persistenced.service.
Job for nvidia-persistenced.service failed because the control process exited with error code.
See "systemctl status nvidia-persistenced.service" and "journalctl -xe" for details.
Paramétrage de nvidia-egl-icd:amd64 (470.57.02-2) ...
Paramétrage de libnvidia-encode1:amd64 (470.57.02-2) ...
Paramétrage de nvidia-driver-libs:amd64 (470.57.02-2) ...
Traitement des actions différées (« triggers ») pour nvidia-alternative (470.57.02-2) ...
update-alternatives: mise à jour de l'alternative /usr/lib/nvidia/current car le groupe de liens nvidia contient des liens esclaves modifiés
Paramétrage de nvidia-kernel-dkms (470.57.02-2) ...
Loading new nvidia-current-470.57.02 DKMS files...
Building for 5.14.0-1-amd64
Building initial module for 5.14.0-1-amd64
Error! Bad return status for module build on kernel: 5.14.0-1-amd64 (x86_64)
Consult /var/lib/dkms/nvidia-current/470.57.02/build/make.log for more information.
dpkg: erreur de traitement du paquet nvidia-kernel-dkms (--configure) :
 installed nvidia-kernel-dkms package post-installation script subprocess returned error exit status 10
dpkg: des problèmes de dépendances empêchent la configuration de nvidia-driver :
 nvidia-driver dépend de nvidia-kernel-dkms (= 470.57.02-2) | nvidia-kernel-470.57.02 ; cependant :
 Le paquet nvidia-kernel-dkms n'est pas encore configuré.
  Le paquet nvidia-kernel-470.57.02 n'est pas installé.
  Le paquet nvidia-kernel-dkms qui fournit nvidia-kernel-470.57.02 n'est pas encore configuré.

dpkg: erreur de traitement du paquet nvidia-driver (--configure) :
 problèmes de dépendances - laissé non configuré
Traitement des actions différées (« triggers ») pour libc-bin (2.32-4) ...
Traitement des actions différées (« triggers ») pour initramfs-tools (0.140) ...
update-initramfs: Generating /boot/initrd.img-5.14.0-1-amd64
Traitement des actions différées (« triggers ») pour update-glx (1.2.0) ...
Traitement des actions différées (« triggers ») pour glx-alternative-nvidia (1.2.0) ...
update-alternatives: utilisation de « /usr/lib/nvidia » pour fournir « /usr/lib/glx » (glx) en mode automatique
Traitement des actions différées (« triggers ») pour glx-alternative-mesa (1.2.0) ...
Traitement des actions différées (« triggers ») pour libc-bin (2.32-4) ...
Traitement des actions différées (« triggers ») pour initramfs-tools (0.140) ...
update-initramfs: Generating /boot/initrd.img-5.14.0-1-amd64
Des erreurs ont été rencontrées pendant l'exécution :
 nvidia-kernel-dkms
 nvidia-driver
E: Sub-process /usr/bin/dpkg returned an error code (1)
 


on va trouver une solution provisoire le temps que le bug soit résolu

ps: une remarque , l'installation des paquets a pioché dans bullseye et bookworm (j'ai toujours le sources.list avec les deux distrib)

Hors ligne

#6 29-09-2021 14:47:38

robert2a
Membre
Inscription : 15-11-2014

Re : reinstallation driver graphique compliqué debian testing

voila le driver fonctionnel


glxinfo -B
name of display: :0
display: :0  screen: 0
direct rendering: Yes
Memory info (GL_NVX_gpu_memory_info):
    Dedicated video memory: 1024 MB
    Total available memory: 1024 MB
    Currently available dedicated video memory: 907 MB
OpenGL vendor string: NVIDIA Corporation
OpenGL renderer string: NVIDIA GeForce GTX 750/PCIe/SSE2
OpenGL core profile version string: 4.6.0 NVIDIA 470.57.02
OpenGL core profile shading language version string: 4.60 NVIDIA
OpenGL core profile context flags: (none)
OpenGL core profile profile mask: core profile

OpenGL version string: 4.6.0 NVIDIA 470.57.02
OpenGL shading language version string: 4.60 NVIDIA
OpenGL context flags: (none)
OpenGL profile mask: (none)

OpenGL ES profile version string: OpenGL ES 3.2 NVIDIA 470.57.02
OpenGL ES profile shading language version string: OpenGL ES GLSL ES 3.20
 


avec le noyau de bullseye


uname -a
Linux debian2 5.10.0-8-amd64 #1 SMP Debian 5.10.46-5 (2021-09-23) x86_64 GNU/Linux
 


ce qui est important


Récupération des rapports de bogue… Fait
Analyse des informations Trouvé/Corrigé… Fait
bogues de gravité serious sur glx-diversions (→ 1.2.0) <En attente de traitement>
 b1 - #993338 - octave: Setting up octave fails due to missing libGL.so.1
bogues de gravité serious sur nvidia-driver (→ 470.57.02-2) <Résolus dans une version donnée>
 b2 - #994860 - nvidia-driver: Does not build against new kernel 5.14.0-1-amd64 (Corrigé : nvidia-graphics-drivers-tesla-470/470.57.02-2 nvidia-graphics-drivers/470.57.02-3)
Résumé :
 glx-diversions(1 bogue), nvidia-driver(1 bogue)
Êtes-vous certain(e) de vouloir installer/mettre à niveau les paquets ci-dessus ? [Y/n/?/...]
 



le retour de l'installation avec le noyau de bullseye (headers et outil de compilation (linux-kbuild) )


Created symlink /etc/systemd/system/multi-user.target.wants/nvidia-persistenced.service → /lib/systemd/system/nvidia-persistenced.service.
Job for nvidia-persistenced.service failed because the control process exited with error code.
See "systemctl status nvidia-persistenced.service" and "journalctl -xe" for details.
Paramétrage de nvidia-egl-icd:amd64 (470.57.02-2) ...
Paramétrage de libnvidia-encode1:amd64 (470.57.02-2) ...
Paramétrage de nvidia-driver-libs:amd64 (470.57.02-2) ...
Traitement des actions différées (« triggers ») pour nvidia-alternative (470.57.02-2) ...
update-alternatives: mise à jour de l'alternative /usr/lib/nvidia/current car le groupe de liens nvidia contient des liens esclaves modifiés
Paramétrage de nvidia-kernel-dkms (470.57.02-2) ...
Loading new nvidia-current-470.57.02 DKMS files...
Building for 5.10.0-8-amd64
Building initial module for 5.10.0-8-amd64
Done.

nvidia-current.ko:
Running module version sanity check.
 - Original module
   - No original module exists within this kernel
 - Installation
   - Installing to /lib/modules/5.10.0-8-amd64/updates/dkms/

nvidia-current-modeset.ko:
Running module version sanity check.
 - Original module
   - No original module exists within this kernel
 - Installation
   - Installing to /lib/modules/5.10.0-8-amd64/updates/dkms/

nvidia-current-drm.ko:
Running module version sanity check.
 - Original module
   - No original module exists within this kernel
 - Installation
   - Installing to /lib/modules/5.10.0-8-amd64/updates/dkms/

nvidia-current-peermem.ko:
Running module version sanity check.
 - Original module
   - No original module exists within this kernel
 - Installation
   - Installing to /lib/modules/5.10.0-8-amd64/updates/dkms/

nvidia-current-uvm.ko:
Running module version sanity check.
 - Original module
   - No original module exists within this kernel
 - Installation
   - Installing to /lib/modules/5.10.0-8-amd64/updates/dkms/

depmod.......

DKMS: install completed.
Paramétrage de nvidia-driver (470.57.02-2) ...
Traitement des actions différées (« triggers ») pour libc-bin (2.32-4) ...
Traitement des actions différées (« triggers ») pour initramfs-tools (0.140) ...
update-initramfs: Generating /boot/initrd.img-5.10.0-8-amd64
Traitement des actions différées (« triggers ») pour update-glx (1.2.0) ...
Traitement des actions différées (« triggers ») pour glx-alternative-nvidia (1.2.0) ...
update-alternatives: utilisation de « /usr/lib/nvidia » pour fournir « /usr/lib/glx » (glx) en mode automatique
Traitement des actions différées (« triggers ») pour glx-alternative-mesa (1.2.0) ...
Traitement des actions différées (« triggers ») pour libc-bin (2.32-4) ...
Traitement des actions différées (« triggers ») pour initramfs-tools (0.140) ...
update-initramfs: Generating /boot/initrd.img-5.10.0-8-amd64
 



soit tu attends que ce soit résolu , soit tu boute sur le noyau de bullseye et tu supprime le noyau de testing
comme ceci


apt remove --purge linux-image-5.14.0-1-amd64 linux-headers-5.14.0-1-amd64 linux-image-amd64 linux-headers-amd64
Lecture des listes de paquets... Fait
Construction de l'arbre des dépendances... Fait
Lecture des informations d'
état... Fait      
Les paquets suivants ont été installés automatiquement et ne sont plus nécessaires :
  linux-headers-5.14.0-1-common linux-kbuild-5.14
Veuillez utiliser « apt autoremove » pour les supprimer.
Les paquets suivants seront ENLEVÉS :
  linux-headers-5.14.0-1-amd64* linux-headers-amd64* linux-image-5.14.0-1-amd64* linux-image-amd64*
0 mis à jour, 0 nouvellement installés, 4 à enlever et 0 non mis à jour.
 


et tu installe ton driver nvidia

pour purger un driver nvidia


apt-get remove --purge nvidia* xserver-xorg-video-nvidia
 



apt-get autoremove --purge
 



voilà , si quelque chose te tracasse pose la question smile

Hors ligne

#7 01-10-2021 10:56:57

ouatou
Membre
Distrib. : bookworm
Noyau : Linux 5.14.0-1-amd64
(G)UI : gnome
Inscription : 07-11-2014

Re : reinstallation driver graphique compliqué debian testing

merci pour ta réponse très détaillé.

Effectivement mon source.list n’était que sur testing enfin brook, en général je passe de testing en testing et lorsque je migre ne ne conserve pas le source.liste de l’ancienne car je croyais peut être a tors que cela causait des soucis de dépendance, j'ai adopter le source.list que tu m'as conseillé, et je commenterais au besoin.

cela ne risque pas de poser de problème par la suite ou bien non puisque un noyaux de chaque ? Ou alors le système prendra les paquets les plus récent que se soit brook ou blueye et la migration serra plus douce jusqu’à ce qu'ils n'en prenne plus du tout dans blueye ?


le plus simple dans mon cas est je pense d'attendre que le bug sois résolu tout simplement, j'ai crus que c'était moi qui avais fais des fausses manip très sincèrement je ne voyais pas lesquelles.

en tout cas merci pour toute c'est précisions et je me rend compte que bien des foid j'ai réinstallé tout le système pour ce genre de souci ou je peinais a comprendre alors que peut être il aurait suffis d'attendre.

Dernière modification par ouatou (01-10-2021 11:26:34)

Hors ligne

#8 01-10-2021 11:50:34

robert2a
Membre
Inscription : 15-11-2014

Re : reinstallation driver graphique compliqué debian testing

Bonjour
actuellement j'ai retirer les lignes de bullseye sur mes testing  (plus grand chose de stable installé )
par contre oui pour le driver nvidia pas la peine de réinstaller debian
si tu utilise le driver plus cuda tu a toujours une version image/headers et driver qui fonctionne correctement
idem si l'installation échoue pas la peine de redémarrer , tu le purge et tu recommence avec d'autres versions ou tu utilise nouveau si il fonctionne correctement le temps que ce soit résolu
en général sur stable pas de soucis de driver avec son noyau et headers
tu vois que le driver de testing fonctionne parfaitement avec le noyau de stable . (pas toujours le cas)
tu vois dans la console a l'installation si un souci ( en général une erreur de compilation des modules du noyau )
pour l'instant rien de mieux avec le 5.14.6-2 (testing) et 5.14.6-3(sid) , il va falloir attendre
utiliser le paquet apt-listbugs  smile

Hors ligne

#9 01-10-2021 12:56:03

robert2a
Membre
Inscription : 15-11-2014

Re : reinstallation driver graphique compliqué debian testing

pour information le driver de sid fonctionne bien aussi avec le noyau/headers de bullseye


DKMS: install completed.
Paramétrage de nvidia-smi (470.63.01-1) ...
Paramétrage de nvidia-driver-bin (470.63.01-1) ...
Paramétrage de nvidia-driver-libs:amd64 (470.63.01-1) ...
Paramétrage de libnvcuvid1:amd64 (470.63.01-1) ...
Paramétrage de nvidia-driver (470.63.01-1) ...
Paramétrage de libnvidia-encode1:amd64 (470.63.01-1) ...
 


ps: basculer ma testing en sid

lorsque le noyau/headers de testing sera correct il suffit de commenter les lignes de bullseye dans le sources.list et supprimer le noyau/headers de bullseye

Hors ligne

Pied de page des forums