Debian-facile

Bienvenue sur Debian-Facile, site d'aide pour les nouveaux utilisateurs de Debian.

Vous n'êtes pas identifié(e).

#1 18-05-2020 06:01:30

alain65
Membre
Lieu : chelles
Distrib. : Debian GNU/Linux 10
Noyau : Linux 4.19.0-6-amd64 (x86_64)
(G)UI : KDE (kwin)
Inscription : 26-07-2016

Impossible d'installer nvidia-driver sur debian 10.4 kernel 4.19.0-9

Bonjour la communauté DF smile

Je viens d'installer une debian 10.4 xfce sur une nouvelle machine, elle est ancienne en age, mais nouvelle pour moi.
Dont voici les principales caractéristiques:

alain@mpat-pc:~$ inxi -Fxx
System:
  Host: mpat-pc Kernel: 4.19.0-9-amd64 x86_64 bits: 64 compiler: gcc
  v: 8.3.0 Desktop: Xfce 4.12.4 tk: Gtk 2.24.32 wm: xfwm4 dm: LightDM
  Distro: Debian GNU/Linux 10 (buster)
Machine:
  Type: Desktop Mobo: MSI model: MS-7194 v: 1A serial: <root required>
  BIOS: American Megatrends v: 080012 date: 12/06/2005
CPU:
  Topology: Dual Core model: AMD Athlon 64 X2 4600+ bits: 64 type: MCP
  arch: K8 rev.E rev: 2 L2 cache: 1024 KiB
  flags: lm nx pae sse sse2 sse3 bogomips: 4020
  Speed: 1000 MHz min/max: 1000/2400 MHz Core speeds (MHz): 1: 1000 2: 1000
Graphics:
  Device-1: NVIDIA GK106 [GeForce GTX 650 Ti] vendor: Gigabyte
  driver: nouveau v: kernel bus ID: 01:00.0 chip ID: 10de:11c6
  Display: x11 server: X.Org 1.20.4 driver: modesetting unloaded: fbdev,vesa
  resolution: 1280x1024~60Hz
  OpenGL: renderer: NVE6 v: 4.3 Mesa 18.3.6 direct render: Yes
Audio:
  Device-1: ULi HD Audio vendor: Micro-Star MSI driver: snd_hda_intel
  v: kernel bus ID: 00:1d.0 chip ID: 10b9:5461
  Device-2: NVIDIA GK106 HDMI Audio vendor: Gigabyte driver: snd_hda_intel
  v: kernel bus ID: 01:00.1 chip ID: 10de:0e0b
  Sound Server: ALSA v: k4.19.0-9-amd64
Network:
  Device-1: ULi M7101 Power Management [PMU] type: network bridge
  driver: N/A port: N/A bus ID: 00:1e.1 chip ID: 10b9:7101
  Device-2: Realtek RTL8169 PCI Gigabit Ethernet vendor: Micro-Star MSI
  driver: r8169 v: kernel port: e400 bus ID: 02:16.0 chip ID: 10ec:8169
  IF: enp2s22 state: up speed: 100 Mbps duplex: full mac: 00:13:d3:ee:b7:de
Drives:
  Local Storage: total: 149.05 GiB used: 47.75 GiB (32.0%)
  ID-1: /dev/sda vendor: Western Digital model: WD1600AAJB-00J3A0
  size: 149.05 GiB speed: <unknown> serial: WD-WCAV3E537267
RAID:
  Hardware-1: ULi ULi 5287 SATA driver: sata_uli v: 1.3 bus ID: 00:1f.1
  chip ID: 10b9.5287
Partition:
  ID-1: / size: 29.40 GiB used: 7.35 GiB (25.0%) fs: ext4 dev: /dev/sda1
  ID-2: /home size: 77.54 GiB used: 40.40 GiB (52.1%) fs: ext4
  dev: /dev/sda3
  ID-3: swap-1 size: 6.00 GiB used: 0 KiB (0.0%) fs: swap dev: /dev/sda2
Sensors:
  System Temperatures: cpu: 39.0 C mobo: N/A gpu: nouveau temp: 31 C
  Fan Speeds (RPM): N/A gpu: nouveau fan: 1410
alain@mpat-pc:~$ sudo inxi -m
Memory:
  RAM: total: 3.18 GiB used: 1.17 GiB (36.9%)
  Array-1: capacity: 8 GiB note: check slots: 2 EC: None
  alain@mpat-pc:~$
 



Depuis des lustres, j'utilise cette procédure pour installer le pilote propriétaire Nvidia, sans aucun problème: Pilote propriétaire NVIDIA
Mais cette fois ci ça ne fonctionne pas... hmm

C'est une installation fraîche et à jour.

Voici les retours (écris à la main because TTY) à la fin du processus d'installation: (apt install linux-headers-$(uname -r|sed 's/[^-]*-[^-]*-//') nvidia-driver)

dpkg :  erreur de traitement du paquet nvidia-driver (--configure)
problèmes de dépendances laissées non configurées
des erreurs ont été rencontrées pendant l'execution :
nvidia-kernel-dkms
nvidia-driver
E: Sub-process /usr/bin/dpkg return an error code (1)


J'ai certainement fait quelques erreurs de recopie, mais vous voyez le genre...

pour essayer de réparer j'ai fait:

sudo apt install -f && sudo dpkg --configure -pending


séparément ou ensemble et aussi avec -a à la place de pending.
Rien à faire ça me sort toujours les messages indiqués au dessus...

j'ai fait trois l'installation du pilote , trois fois pareil. Obligé de désinstaller le pilote nvidia et de remettre nouveau.
Je n'arrive pas a voir où ça cloche sad

Pourtant j'ai installé ce pilote (418) sur une debian 10.3, pas le meme matos, c'est sur mais le meme cpu. Et ça c'est très bien passé avec cette procédure. Idem sur plusieurs stretch il y a un an ou deux...

J'ai fait des recherches sur internet, pas trouvé de cas semblable, error code (1) à foison, certes, mais lié à d'autres installes.

Une dernière chose, nouveau fonctionne très bien sur cet ordi, oui mais voila il me faut le propriétaire pour faire du calcul parallèle.
Je pourrais essayer avec une autre distribution, mais j'aime bien debian et en plus elle laisse beaucoup de ressources pour le calcul par rapport a disons...ubuntu ou LinuxMint....

Je suis prêt a lire vos propositions pour que je puisse installer le pilote nvidia sur une debian 10.4.help.gif

Par avance merci et bonne journée à tous   wink


In a world without walls and fences, who needs windows and gates?
A computer is like air conditioning - it becomes useless when you open Windows (L.T)
file-R82e72401f1fc045b22e79ab7e9ca81e8
Quelques une de mes machines

Hors ligne

#2 18-05-2020 07:19:22

chalu
Modératrice
Lieu : Anjou
Distrib. : openSUSE Leap 15.1
Noyau : Linux 4.12.14
(G)UI : KDE 5
Inscription : 11-03-2016

Re : Impossible d'installer nvidia-driver sur debian 10.4 kernel 4.19.0-9

Bonjour smile
As-tu essayé de tout purger puis de réinstaller

apt purge nvidia*


apt install linux-headers-amd64


puis

apt install nvidia-driver

Hors ligne

#3 18-05-2020 07:25:53

alain65
Membre
Lieu : chelles
Distrib. : Debian GNU/Linux 10
Noyau : Linux 4.19.0-6-amd64 (x86_64)
(G)UI : KDE (kwin)
Inscription : 26-07-2016

Re : Impossible d'installer nvidia-driver sur debian 10.4 kernel 4.19.0-9

Bonjour Chalu.

Oui 3 fois...

alain65 a écrit :


j'ai fait trois l'installation du pilote , trois fois pareil. Obligé de désinstaller le pilote nvidia et de remettre nouveau.

Dernière modification par alain65 (18-05-2020 07:27:59)


In a world without walls and fences, who needs windows and gates?
A computer is like air conditioning - it becomes useless when you open Windows (L.T)
file-R82e72401f1fc045b22e79ab7e9ca81e8
Quelques une de mes machines

Hors ligne

#4 18-05-2020 07:37:15

chalu
Modératrice
Lieu : Anjou
Distrib. : openSUSE Leap 15.1
Noyau : Linux 4.12.14
(G)UI : KDE 5
Inscription : 11-03-2016

Re : Impossible d'installer nvidia-driver sur debian 10.4 kernel 4.19.0-9

Et tu as vérifié que le système est bien à jour avant d’installer ?

Hors ligne

#5 18-05-2020 07:45:18

alain65
Membre
Lieu : chelles
Distrib. : Debian GNU/Linux 10
Noyau : Linux 4.19.0-6-amd64 (x86_64)
(G)UI : KDE (kwin)
Inscription : 26-07-2016

Re : Impossible d'installer nvidia-driver sur debian 10.4 kernel 4.19.0-9

Oui Chalu :

alain65 a écrit :



C'est une installation fraîche et à jour.


In a world without walls and fences, who needs windows and gates?
A computer is like air conditioning - it becomes useless when you open Windows (L.T)
file-R82e72401f1fc045b22e79ab7e9ca81e8
Quelques une de mes machines

Hors ligne

#6 18-05-2020 07:52:02

chalu
Modératrice
Lieu : Anjou
Distrib. : openSUSE Leap 15.1
Noyau : Linux 4.12.14
(G)UI : KDE 5
Inscription : 11-03-2016

Re : Impossible d'installer nvidia-driver sur debian 10.4 kernel 4.19.0-9

Ok, je pense que tu devrais donner l’intégralité des commandes et leurs retours pour la suppression puis l'installation pour que ce soit le plus clair et complet possible wink
Bon courage smile

Hors ligne

#7 18-05-2020 08:37:12

alain65
Membre
Lieu : chelles
Distrib. : Debian GNU/Linux 10
Noyau : Linux 4.19.0-6-amd64 (x86_64)
(G)UI : KDE (kwin)
Inscription : 26-07-2016

Re : Impossible d'installer nvidia-driver sur debian 10.4 kernel 4.19.0-9

J'ai fait exactement a 3 reprises pour l'installation et pour la désinstallation, ce qui est indiqué de faire dans le lien que j'ai mis dans mon premier post:

alain65 a écrit :


Depuis des lustres, j'utilise cette procédure pour installer le pilote propriétaire Nvidia, sans aucun problème: Pilote propriétaire NVIDIA
Mais cette fois ci ça ne fonctionne pas... hmm


Au chapitre Nvidia 418. Mon lien arrive directement au bon chapitre.
Pour la désinstallation c'est tout à la fin de la procédure.

Merci Chalu, de t'intéresser à mon problème smile

Je reprends le boulot ce soir, alors je n'aurai pas le temps de mettre en application vos propositions avant la nuit de mercredi. Mais soyez assurés que je les lirais et analyserais avec avec grand intérêt pendant mes pauses.

Dernière modification par alain65 (18-05-2020 08:41:11)


In a world without walls and fences, who needs windows and gates?
A computer is like air conditioning - it becomes useless when you open Windows (L.T)
file-R82e72401f1fc045b22e79ab7e9ca81e8
Quelques une de mes machines

Hors ligne

#8 21-05-2020 05:27:37

alain65
Membre
Lieu : chelles
Distrib. : Debian GNU/Linux 10
Noyau : Linux 4.19.0-6-amd64 (x86_64)
(G)UI : KDE (kwin)
Inscription : 26-07-2016

Re : Impossible d'installer nvidia-driver sur debian 10.4 kernel 4.19.0-9

Hello all smile

Je me permet un petit "up". Vu que mon sujet est tombé loin en dessous des récents hmm
J'ai encore cette nuit pour faire des essais d'installation du pilote Nvidia sur cet ordi, ensuite plus avant la nuit de lundi.
Alors si vous avez des propositions que je pourrais mettre en application cette nuit  wink merci.gif

Bonne journée à tous smile

In a world without walls and fences, who needs windows and gates?
A computer is like air conditioning - it becomes useless when you open Windows (L.T)
file-R82e72401f1fc045b22e79ab7e9ca81e8
Quelques une de mes machines

Hors ligne

#9 21-05-2020 08:16:47

chalu
Modératrice
Lieu : Anjou
Distrib. : openSUSE Leap 15.1
Noyau : Linux 4.12.14
(G)UI : KDE 5
Inscription : 11-03-2016

Re : Impossible d'installer nvidia-driver sur debian 10.4 kernel 4.19.0-9

Comme je te l’ai dit plus haut, pour que les connaisseurs Nvidia puissent t’aider, mets l'intégralité des commandes et des retours, ce n’est pas pour t’ennuyer mais sans le PC sous les yeux, c’est la seule méthode possible.
Bon courage smile

Hors ligne

#10 21-05-2020 08:27:52

Debian Alain
Adhérent(e)
Distrib. : stable / ubuntu / testing
Noyau : Linux 5.6.14 - amd 64
(G)UI : Gnome X.org (X11) / GDM3
Inscription : 11-03-2017

Re : Impossible d'installer nvidia-driver sur debian 10.4 kernel 4.19.0-9

que donne nvidia detect ?

https://debian-facile.org/doc:materiel: … -graphique

apt-get install nvidia-detect


détection carte graphique et affichage pilote proprio recommandé :

nvidia-detect



listing cartes graphiques et pilotes :

lspci -nnkd::0300



repositories :

inxi -r

Dernière modification par Debian Alain (21-05-2020 08:35:04)

Hors ligne

#11 21-05-2020 12:39:26

robert2a
Membre
Lieu : France
Distrib. : debian 10
Noyau : 4.19
(G)UI : Gnome
Inscription : 15-11-2014

Re : Impossible d'installer nvidia-driver sur debian 10.4 kernel 4.19.0-9

Bonjour

il faut regarder du coté des drivers compatibles avec ta carte graphique
sinon
modifier le sources.list
installer (reinstaller) les méta paquet image et headers


apt-get --reinstall install linux-image-amd64 linux-headers-amd64
 


installer le driver (la bonne version si possible pour la carte et si compatible avec la version de debian )


apt-get install nvidia-driver-la bonne version
 


regarder le log dans la console si tout est correct

ps: attention certaines cartes (ancienne) ne sont plus compatible avec debian , le driver nonfree n'est plus disponible (seulement avec nouveau)
donc a vérifier  smile

ps: tu purge bien les paquets nvidia des tests précédent .

Hors ligne

#12 21-05-2020 17:36:07

alain65
Membre
Lieu : chelles
Distrib. : Debian GNU/Linux 10
Noyau : Linux 4.19.0-6-amd64 (x86_64)
(G)UI : KDE (kwin)
Inscription : 26-07-2016

Re : Impossible d'installer nvidia-driver sur debian 10.4 kernel 4.19.0-9

Bonjour Chalu

chalu a écrit :

ce n’est pas pour t’ennuyer mais sans le PC sous les yeux, c’est la seule méthode possible.


ça ne m'embête pas du tout, mais j'ai fait exactement ce qu'il est proposé de faire dans le lien que je donne.
Si je n'ai pas donné tous les retours, c'est parce que j'ai pris l'habitude, comme préconiser sur les docs debian, d'installer les pilotes propriétaires depuis une console TTY. Et cette fois ci, bien m'en à pris, car cela me permet de purger nvidia à la fin de l'installation qui c'est mal passé. et donc de pouvoir redémarrer sans problème une session graphique ensuite.
J'ai quand même essayé au mieux de recopier "à la main" les messages d'erreurs en fin d'installation, avant ces messages il n' y a rien de mauvais. 

Debian Alain a écrit :

que donne nvidia detect ?


Je ne suis pas actuellement sur le le PC concerné mais je sais qu'il me dit que j'ai une GTX 650 TI et qu'il me faut
le pilote nivdia-drivers.
Je refais les commandes demandées tout à l'heure quand je serai à cet ordi et donnerai les retours.
Pour les repos, je peux déjà dire que j'ai ajouté "non free" comme demandé dans la procédure.
Je m'arrêterai à inxi -r car l'installation proprement dite je ne la ferai pas depuis un terminal de la session graphique, car comme ça ne fonctionne pas je le fais depuis une console TTY, donc difficile de donner plus d'infos " à la main", que ce que j'ai donné dans mon premier post

robert2a a écrit :

Bonjour

il faut regarder du coté des drivers compatibles avec ta carte graphique

ps: attention certaines cartes (ancienne) ne sont plus compatible avec debian , le driver nonfree n'est plus disponible (seulement avec nouveau)
donc a vérifier  smile

C'est fait, voir ma réponse à Debian Alain. Promis tout à l'heure je lance nvidia-détect dans un terminal, pour copier coller le retour.
La GTX 650 a beau n'être pas très récente elle elle toujours compatible avec le pilote nvidia 418.

robert2a a écrit :


regarder le log dans la console si tout est correct

Celui proposé à la fin de l'installation? celui qu'il est préconisé de regarder quand ça retourne les messages d'erreurs de mon premier post? si c'est celui la effectivement ça dit que dpkg n'a pas pu faire son boulot, mais par contre je n'ai pas pu recoipier ici son contenu car je fais l'installation en TTY. A la prochaine tentative d'installation, je vais recopier le chemin du log proposé à la main et après purge j'irai voir dedans depuis un terminal lancé depuis la session graphique.

robert2a a écrit :


ps: tu purge bien les paquets nvidia des tests précédent .

Oui...

Merci à vous trois smile


In a world without walls and fences, who needs windows and gates?
A computer is like air conditioning - it becomes useless when you open Windows (L.T)
file-R82e72401f1fc045b22e79ab7e9ca81e8
Quelques une de mes machines

Hors ligne

#13 21-05-2020 17:44:04

Debian Alain
Adhérent(e)
Distrib. : stable / ubuntu / testing
Noyau : Linux 5.6.14 - amd 64
(G)UI : Gnome X.org (X11) / GDM3
Inscription : 11-03-2017

Re : Impossible d'installer nvidia-driver sur debian 10.4 kernel 4.19.0-9

alain65 , puisque tu travailles en tty , penses à installer pastebinit .
https://wiki.debian.org/fr/Pastebinit
çà donne un lien de la copie d'écran texte qu'on peut ensuite consulter  sur internet .
exemple :

df -hT | pastebinit


https://paste.debian.net/1148161/

Dernière modification par Debian Alain (21-05-2020 17:46:35)

Hors ligne

#14 21-05-2020 20:01:01

chalu
Modératrice
Lieu : Anjou
Distrib. : openSUSE Leap 15.1
Noyau : Linux 4.12.14
(G)UI : KDE 5
Inscription : 11-03-2016

Re : Impossible d'installer nvidia-driver sur debian 10.4 kernel 4.19.0-9

C’est super ça smile on aura les écrans quand même

Hors ligne

#15 22-05-2020 04:13:04

alain65
Membre
Lieu : chelles
Distrib. : Debian GNU/Linux 10
Noyau : Linux 4.19.0-6-amd64 (x86_64)
(G)UI : KDE (kwin)
Inscription : 26-07-2016

Re : Impossible d'installer nvidia-driver sur debian 10.4 kernel 4.19.0-9

Bonjour @ tous (oui je dis bonjour, car pour vous ça doit etre un autre jour smile

Voila je fait toutes les commandes démandées, en espérant ne pas en oublier:

D’abord celles demandées par Debian Alain:

alain@mpat-pc:~$ sudo apt-get install nvidia-detect



[sudo] Mot de passe de alain : 
Lecture des listes de paquets... Fait
Construction de l'arbre des dépendances      
Lecture des informations d'état... Fait
Les paquets suivants ont été installés automatiquement et ne sont plus nécessaires :
  distro-info-data dkms glx-alternative-mesa libgles1 libopengl0 lsb-release update-glx
Veuillez utiliser « sudo apt autoremove » pour les supprimer.
Les NOUVEAUX paquets suivants seront installés :
  nvidia-detect
0 mis à jour, 1 nouvellement installés, 0 à enlever et 0 non mis à jour.
Il est nécessaire de prendre 0 o/208 ko dans les archives.
Après cette opération, 267 ko d'espace disque supplémentaires seront utilisés.
Sélection du paquet nvidia-detect précédemment désélectionné.
(Lecture de la base de données... 304145 fichiers et répertoires déjà installés.)
Préparation du dépaquetage de .../nvidia-detect_418.113-1_amd64.deb ...
Dépaquetage de nvidia-detect (418.113-1) ...
Paramétrage de nvidia-detect (418.113-1) ...
alain@mpat-pc:~$
 


Puis:

alain@mpat-pc:~$ nvidia-detect


Detected NVIDIA GPUs:
01:00.0 VGA compatible controller [0300]: NVIDIA Corporation GK106 [GeForce GTX 650 Ti] [10de:11c6] (rev a1)

Checking card:  NVIDIA Corporation GK106 [GeForce GTX 650 Ti] (rev a1)
Your card is supported by all driver versions.
It is recommended to install the
    nvidia-driver
package.
alain@mpat-pc:~$
 


Et:

alain@mpat-pc:~$ lspci -nnkd::0300



01:00.0 VGA compatible controller [0300]: NVIDIA Corporation GK106 [GeForce GTX 650 Ti] [10de:11c6] (rev a1)
  Subsystem: Gigabyte Technology Co., Ltd GK106 [GeForce GTX 650 Ti] [1458:3618]
  Kernel driver in use: nouveau
  Kernel modules: nouveau
alain@mpat-pc:~$


Pour terminer avec celles de Debian Alain:

alain@mpat-pc:~$ inxi -r



Repos:     Active apt repos in: /etc/apt/sources.list
           1: deb http://deb.debian.org/debian buster main contrib non-free
           2: deb-src http://deb.debian.org/debian buster main
           3: deb http://deb.debian.org/debian buster-updates main
           4: deb-src http://deb.debian.org/debian buster-updates main
           5: deb http://security.debian.org/debian-security/ buster/updates main
           6: deb-src http://security.debian.org/debian-security/ buster/updates main
alain@mpat-pc:~$

ici on y voit bien le "non-free" necessaire pour l'installation du paquet nvidia, que je n'ai pas enlevé pour le remettre juste après.

Maintenant celles proposées par Robert2a: (en fonction des retours précédents, càd en installant nividia-driver car c'est ce paquet qui contient le pilote ad-hoc pour ma GTX 650Ti)
A partir d'ici, je passe en TTY avec pastebinit, je ne mets donc que les liens paste.debian.net

Pour:

apt-get --reinstall install linux-image-amd64 linux-headers-amd64



https://paste.debian.net/1148227/

Et pour:

apt-get install nvidia-driver


NB: en installant "nvidia-driver" sans numéro de version, c'est la version disponible dans le dépôt non-free qui va être installée, c'est comme cela qu'il faut procéder sinon forcément, si on lui ajoute un numéro de version quelconque, il ne trouvera jamais le paquet. Et, au passage, c'est ce paquet que "nvidia-détect" demande à installer (voir retour plus haut).

https://paste.debian.net/1148231/

Dans ce pastebinit on voit qu'il est préconisé de regarder ce log, donc je vous en donne le retour:

cat /var/lib/dkms/nvidia-current/418.113/build/make.log


.c
   ./tools/objtool/objtool orc generate  --module --no-fp --retpoline "/var/lib/dkms/nvidia-current/418.113/build/nvidia-uvm/.tmp_uvm8_populate_pageable.o";
   gcc-8 -Wp,-MD,/var/lib/dkms/nvidia-current/418.113/build/nvidia-uvm/.uvm8_map_external.o.d  -nostdinc -isystem /usr/lib/gcc/x86_64-linux-gnu/8/include -I/usr/src/linux-headers-4.19.0-9-common/arch/x86/include -I./arch/x86/include/generated  -I/usr/src/linux-headers-4.19.0-9-common/include -I./include -I/usr/src/linux-headers-4.19.0-9-common/arch/x86/include/uapi -I./arch/x86/include/generated/uapi -I/usr/src/linux-headers-4.19.0-9-common/include/uapi -I./include/generated/uapi -include /usr/src/linux-headers-4.19.0-9-common/include/linux/kconfig.h -include /usr/src/linux-headers-4.19.0-9-common/include/linux/compiler_types.h  -I/var/lib/dkms/nvidia-current/418.113/build -I/var/lib/dkms/nvidia-current/418.113/build -D__KERNEL__ -Wall -Wundef -Wstrict-prototypes -Wno-trigraphs -fno-strict-aliasing -fno-common -fshort-wchar -Werror-implicit-function-declaration -Wno-format-security -std=gnu89 -fno-PIE -mno-sse -mno-mmx -mno-sse2 -mno-3dnow -mno-avx -m64 -falign-jumps=1 -falign-loops=1 -mno-80387 -mno-fp-ret-in-387 -mpreferred-stack-boundary=3 -mskip-rax-setup -mtune=generic -mno-red-zone -mcmodel=kernel -funit-at-a-time -DCONFIG_X86_X32_ABI -DCONFIG_AS_CFI=1 -DCONFIG_AS_CFI_SIGNAL_FRAME=1 -DCONFIG_AS_CFI_SECTIONS=1 -DCONFIG_AS_FXSAVEQ=1 -DCONFIG_AS_SSSE3=1 -DCONFIG_AS_CRC32=1 -DCONFIG_AS_AVX=1 -DCONFIG_AS_AVX2=1 -DCONFIG_AS_AVX512=1 -DCONFIG_AS_SHA1_NI=1 -DCONFIG_AS_SHA256_NI=1 -pipe -Wno-sign-compare -fno-asynchronous-unwind-tables -mindirect-branch=thunk-extern -mindirect-branch-register -fno-jump-tables -fno-delete-null-pointer-checks -Wno-frame-address -Wno-format-truncation -Wno-format-overflow -Wno-int-in-bool-context -O2 --param=allow-store-data-races=0 -Wframe-larger-than=2048 -fstack-protector-strong -Wno-unused-but-set-variable -Wno-unused-const-variable -fno-var-tracking-assignments -g -pg -mrecord-mcount -mfentry -DCC_USING_FENTRY -Wdeclaration-after-statement -Wno-pointer-sign -Wno-stringop-truncation -fno-strict-overflow -fno-merge-all-constants -fmerge-constants -fno-stack-check -fconserve-stack -Werror=implicit-int -Werror=strict-prototypes -Werror=date-time -Werror=incompatible-pointer-types -Werror=designated-init -fmacro-prefix-map=/usr/src/linux-headers-4.19.0-9-common/= -fcf-protection=none -Wno-packed-not-aligned  -I/var/lib/dkms/nvidia-current/418.113/build/common/inc  -I/var/lib/dkms/nvidia-current/418.113/build -Wall -MD -Wno-cast-qual -Wno-error -Wno-format-extra-args -D__KERNEL__ -DMODULE -DNVRM -DNV_VERSION_STRING=\"418.113\" -Wno-unused-function -Wuninitialized -fno-strict-aliasing -mno-red-zone -mcmodel=kernel -DNV_UVM_ENABLE -Werror=undef -DNV_SPECTRE_V2=0 -O2 -DNVIDIA_UVM_ENABLED -DNVIDIA_UNDEF_LEGACY_BIT_MACROS -DLinux -D__linux__  -I/var/lib/dkms/nvidia-current/418.113/build/nvidia-uvm  -DMODULE  -DKBUILD_BASENAME='"uvm8_map_external"' -DKBUILD_MODNAME='"nvidia_uvm"' -c -o /var/lib/dkms/nvidia-current/418.113/build/nvidia-uvm/.tmp_uvm8_map_external.o /var/lib/dkms/nvidia-current/418.113/build/nvidia-uvm/uvm8_map_external.c
   ./tools/objtool/objtool orc generate  --module --no-fp --retpoline "/var/lib/dkms/nvidia-current/418.113/build/nvidia-uvm/.tmp_uvm8_migrate_pageable.o";
   gcc-8 -Wp,-MD,/var/lib/dkms/nvidia-current/418.113/build/nvidia-uvm/.uvm8_user_channel.o.d  -nostdinc -isystem /usr/lib/gcc/x86_64-linux-gnu/8/include -I/usr/src/linux-headers-4.19.0-9-common/arch/x86/include -I./arch/x86/include/generated  -I/usr/src/linux-headers-4.19.0-9-common/include -I./include -I/usr/src/linux-headers-4.19.0-9-common/arch/x86/include/uapi -I./arch/x86/include/generated/uapi -I/usr/src/linux-headers-4.19.0-9-common/include/uapi -I./include/generated/uapi -include /usr/src/linux-headers-4.19.0-9-common/include/linux/kconfig.h -include /usr/src/linux-headers-4.19.0-9-common/include/linux/compiler_types.h  -I/var/lib/dkms/nvidia-current/418.113/build -I/var/lib/dkms/nvidia-current/418.113/build -D__KERNEL__ -Wall -Wundef -Wstrict-prototypes -Wno-trigraphs -fno-strict-aliasing -fno-common -fshort-wchar -Werror-implicit-function-declaration -Wno-format-security -std=gnu89 -fno-PIE -mno-sse -mno-mmx -mno-sse2 -mno-3dnow -mno-avx -m64 -falign-jumps=1 -falign-loops=1 -mno-80387 -mno-fp-ret-in-387 -mpreferred-stack-boundary=3 -mskip-rax-setup -mtune=generic -mno-red-zone -mcmodel=kernel -funit-at-a-time -DCONFIG_X86_X32_ABI -DCONFIG_AS_CFI=1 -DCONFIG_AS_CFI_SIGNAL_FRAME=1 -DCONFIG_AS_CFI_SECTIONS=1 -DCONFIG_AS_FXSAVEQ=1 -DCONFIG_AS_SSSE3=1 -DCONFIG_AS_CRC32=1 -DCONFIG_AS_AVX=1 -DCONFIG_AS_AVX2=1 -DCONFIG_AS_AVX512=1 -DCONFIG_AS_SHA1_NI=1 -DCONFIG_AS_SHA256_NI=1 -pipe -Wno-sign-compare -fno-asynchronous-unwind-tables -mindirect-branch=thunk-extern -mindirect-branch-register -fno-jump-tables -fno-delete-null-pointer-checks -Wno-frame-address -Wno-format-truncation -Wno-format-overflow -Wno-int-in-bool-context -O2 --param=allow-store-data-races=0 -Wframe-larger-than=2048 -fstack-protector-strong -Wno-unused-but-set-variable -Wno-unused-const-variable -fno-var-tracking-assignments -g -pg -mrecord-mcount -mfentry -DCC_USING_FENTRY -Wdeclaration-after-statement -Wno-pointer-sign -Wno-stringop-truncation -fno-strict-overflow -fno-merge-all-constants -fmerge-constants -fno-stack-check -fconserve-stack -Werror=implicit-int -Werror=strict-prototypes -Werror=date-time -Werror=incompatible-pointer-types -Werror=designated-init -fmacro-prefix-map=/usr/src/linux-headers-4.19.0-9-common/= -fcf-protection=none -Wno-packed-not-aligned  -I/var/lib/dkms/nvidia-current/418.113/build/common/inc  -I/var/lib/dkms/nvidia-current/418.113/build -Wall -MD -Wno-cast-qual -Wno-error -Wno-format-extra-args -D__KERNEL__ -DMODULE -DNVRM -DNV_VERSION_STRING=\"418.113\" -Wno-unused-function -Wuninitialized -fno-strict-aliasing -mno-red-zone -mcmodel=kernel -DNV_UVM_ENABLE -Werror=undef -DNV_SPECTRE_V2=0 -O2 -DNVIDIA_UVM_ENABLED -DNVIDIA_UNDEF_LEGACY_BIT_MACROS -DLinux -D__linux__  -I/var/lib/dkms/nvidia-current/418.113/build/nvidia-uvm  -DMODULE  -DKBUILD_BASENAME='"uvm8_user_channel"' -DKBUILD_MODNAME='"nvidia_uvm"' -c -o /var/lib/dkms/nvidia-current/418.113/build/nvidia-uvm/.tmp_uvm8_user_channel.o /var/lib/dkms/nvidia-current/418.113/build/nvidia-uvm/uvm8_user_channel.c
   ./tools/objtool/objtool orc generate  --module --no-fp --retpoline "/var/lib/dkms/nvidia-current/418.113/build/nvidia-uvm/.tmp_uvm8_map_external.o";
   gcc-8 -Wp,-MD,/var/lib/dkms/nvidia-current/418.113/build/nvidia-uvm/.uvm8_hmm.o.d  -nostdinc -isystem /usr/lib/gcc/x86_64-linux-gnu/8/include -I/usr/src/linux-headers-4.19.0-9-common/arch/x86/include -I./arch/x86/include/generated  -I/usr/src/linux-headers-4.19.0-9-common/include -I./include -I/usr/src/linux-headers-4.19.0-9-common/arch/x86/include/uapi -I./arch/x86/include/generated/uapi -I/usr/src/linux-headers-4.19.0-9-common/include/uapi -I./include/generated/uapi -include /usr/src/linux-headers-4.19.0-9-common/include/linux/kconfig.h -include /usr/src/linux-headers-4.19.0-9-common/include/linux/compiler_types.h  -I/var/lib/dkms/nvidia-current/418.113/build -I/var/lib/dkms/nvidia-current/418.113/build -D__KERNEL__ -Wall -Wundef -Wstrict-prototypes -Wno-trigraphs -fno-strict-aliasing -fno-common -fshort-wchar -Werror-implicit-function-declaration -Wno-format-security -std=gnu89 -fno-PIE -mno-sse -mno-mmx -mno-sse2 -mno-3dnow -mno-avx -m64 -falign-jumps=1 -falign-loops=1 -mno-80387 -mno-fp-ret-in-387 -mpreferred-stack-boundary=3 -mskip-rax-setup -mtune=generic -mno-red-zone -mcmodel=kernel -funit-at-a-time -DCONFIG_X86_X32_ABI -DCONFIG_AS_CFI=1 -DCONFIG_AS_CFI_SIGNAL_FRAME=1 -DCONFIG_AS_CFI_SECTIONS=1 -DCONFIG_AS_FXSAVEQ=1 -DCONFIG_AS_SSSE3=1 -DCONFIG_AS_CRC32=1 -DCONFIG_AS_AVX=1 -DCONFIG_AS_AVX2=1 -DCONFIG_AS_AVX512=1 -DCONFIG_AS_SHA1_NI=1 -DCONFIG_AS_SHA256_NI=1 -pipe -Wno-sign-compare -fno-asynchronous-unwind-tables -mindirect-branch=thunk-extern -mindirect-branch-register -fno-jump-tables -fno-delete-null-pointer-checks -Wno-frame-address -Wno-format-truncation -Wno-format-overflow -Wno-int-in-bool-context -O2 --param=allow-store-data-races=0 -Wframe-larger-than=2048 -fstack-protector-strong -Wno-unused-but-set-variable -Wno-unused-const-variable -fno-var-tracking-assignments -g -pg -mrecord-mcount -mfentry -DCC_USING_FENTRY -Wdeclaration-after-statement -Wno-pointer-sign -Wno-stringop-truncation -fno-strict-overflow -fno-merge-all-constants -fmerge-constants -fno-stack-check -fconserve-stack -Werror=implicit-int -Werror=strict-prototypes -Werror=date-time -Werror=incompatible-pointer-types -Werror=designated-init -fmacro-prefix-map=/usr/src/linux-headers-4.19.0-9-common/= -fcf-protection=none -Wno-packed-not-aligned  -I/var/lib/dkms/nvidia-current/418.113/build/common/inc  -I/var/lib/dkms/nvidia-current/418.113/build -Wall -MD -Wno-cast-qual -Wno-error -Wno-format-extra-args -D__KERNEL__ -DMODULE -DNVRM -DNV_VERSION_STRING=\"418.113\" -Wno-unused-function -Wuninitialized -fno-strict-aliasing -mno-red-zone -mcmodel=kernel -DNV_UVM_ENABLE -Werror=undef -DNV_SPECTRE_V2=0 -O2 -DNVIDIA_UVM_ENABLED -DNVIDIA_UNDEF_LEGACY_BIT_MACROS -DLinux -D__linux__  -I/var/lib/dkms/nvidia-current/418.113/build/nvidia-uvm  -DMODULE  -DKBUILD_BASENAME='"uvm8_hmm"' -DKBUILD_MODNAME='"nvidia_uvm"' -c -o /var/lib/dkms/nvidia-current/418.113/build/nvidia-uvm/.tmp_uvm8_hmm.o /var/lib/dkms/nvidia-current/418.113/build/nvidia-uvm/uvm8_hmm.c
   ./tools/objtool/objtool orc generate  --module --no-fp --retpoline "/var/lib/dkms/nvidia-current/418.113/build/nvidia-uvm/.tmp_uvm8_user_channel.o";
   gcc-8 -Wp,-MD,/var/lib/dkms/nvidia-current/418.113/build/nvidia-uvm/.uvm8_perf_heuristics.o.d  -nostdinc -isystem /usr/lib/gcc/x86_64-linux-gnu/8/include -I/usr/src/linux-headers-4.19.0-9-common/arch/x86/include -I./arch/x86/include/generated  -I/usr/src/linux-headers-4.19.0-9-common/include -I./include -I/usr/src/linux-headers-4.19.0-9-common/arch/x86/include/uapi -I./arch/x86/include/generated/uapi -I/usr/src/linux-headers-4.19.0-9-common/include/uapi -I./include/generated/uapi -include /usr/src/linux-headers-4.19.0-9-common/include/linux/kconfig.h -include /usr/src/linux-headers-4.19.0-9-common/include/linux/compiler_types.h  -I/var/lib/dkms/nvidia-current/418.113/build -I/var/lib/dkms/nvidia-current/418.113/build -D__KERNEL__ -Wall -Wundef -Wstrict-prototypes -Wno-trigraphs -fno-strict-aliasing -fno-common -fshort-wchar -Werror-implicit-function-declaration -Wno-format-security -std=gnu89 -fno-PIE -mno-sse -mno-mmx -mno-sse2 -mno-3dnow -mno-avx -m64 -falign-jumps=1 -falign-loops=1 -mno-80387 -mno-fp-ret-in-387 -mpreferred-stack-boundary=3 -mskip-rax-setup -mtune=generic -mno-red-zone -mcmodel=kernel -funit-at-a-time -DCONFIG_X86_X32_ABI -DCONFIG_AS_CFI=1 -DCONFIG_AS_CFI_SIGNAL_FRAME=1 -DCONFIG_AS_CFI_SECTIONS=1 -DCONFIG_AS_FXSAVEQ=1 -DCONFIG_AS_SSSE3=1 -DCONFIG_AS_CRC32=1 -DCONFIG_AS_AVX=1 -DCONFIG_AS_AVX2=1 -DCONFIG_AS_AVX512=1 -DCONFIG_AS_SHA1_NI=1 -DCONFIG_AS_SHA256_NI=1 -pipe -Wno-sign-compare -fno-asynchronous-unwind-tables -mindirect-branch=thunk-extern -mindirect-branch-register -fno-jump-tables -fno-delete-null-pointer-checks -Wno-frame-address -Wno-format-truncation -Wno-format-overflow -Wno-int-in-bool-context -O2 --param=allow-store-data-races=0 -Wframe-larger-than=2048 -fstack-protector-strong -Wno-unused-but-set-variable -Wno-unused-const-variable -fno-var-tracking-assignments -g -pg -mrecord-mcount -mfentry -DCC_USING_FENTRY -Wdeclaration-after-statement -Wno-pointer-sign -Wno-stringop-truncation -fno-strict-overflow -fno-merge-all-constants -fmerge-constants -fno-stack-check -fconserve-stack -Werror=implicit-int -Werror=strict-prototypes -Werror=date-time -Werror=incompatible-pointer-types -Werror=designated-init -fmacro-prefix-map=/usr/src/linux-headers-4.19.0-9-common/= -fcf-protection=none -Wno-packed-not-aligned  -I/var/lib/dkms/nvidia-current/418.113/build/common/inc  -I/var/lib/dkms/nvidia-current/418.113/build -Wall -MD -Wno-cast-qual -Wno-error -Wno-format-extra-args -D__KERNEL__ -DMODULE -DNVRM -DNV_VERSION_STRING=\"418.113\" -Wno-unused-function -Wuninitialized -fno-strict-aliasing -mno-red-zone -mcmodel=kernel -DNV_UVM_ENABLE -Werror=undef -DNV_SPECTRE_V2=0 -O2 -DNVIDIA_UVM_ENABLED -DNVIDIA_UNDEF_LEGACY_BIT_MACROS -DLinux -D__linux__  -I/var/lib/dkms/nvidia-current/418.113/build/nvidia-uvm  -DMODULE  -DKBUILD_BASENAME='"uvm8_perf_heuristics"' -DKBUILD_MODNAME='"nvidia_uvm"' -c -o /var/lib/dkms/nvidia-current/418.113/build/nvidia-uvm/.tmp_uvm8_perf_heuristics.o /var/lib/dkms/nvidia-current/418.113/build/nvidia-uvm/uvm8_perf_heuristics.c
   ./tools/objtool/objtool orc generate  --module --no-fp --retpoline "/var/lib/dkms/nvidia-current/418.113/build/nvidia-uvm/.tmp_uvm8_hmm.o";
   gcc-8 -Wp,-MD,/var/lib/dkms/nvidia-current/418.113/build/nvidia-uvm/.uvm8_perf_thrashing.o.d  -nostdinc -isystem /usr/lib/gcc/x86_64-linux-gnu/8/include -I/usr/src/linux-headers-4.19.0-9-common/arch/x86/include -I./arch/x86/include/generated  -I/usr/src/linux-headers-4.19.0-9-common/include -I./include -I/usr/src/linux-headers-4.19.0-9-common/arch/x86/include/uapi -I./arch/x86/include/generated/uapi -I/usr/src/linux-headers-4.19.0-9-common/include/uapi -I./include/generated/uapi -include /usr/src/linux-headers-4.19.0-9-common/include/linux/kconfig.h -include /usr/src/linux-headers-4.19.0-9-common/include/linux/compiler_types.h  -I/var/lib/dkms/nvidia-current/418.113/build -I/var/lib/dkms/nvidia-current/418.113/build -D__KERNEL__ -Wall -Wundef -Wstrict-prototypes -Wno-trigraphs -fno-strict-aliasing -fno-common -fshort-wchar -Werror-implicit-function-declaration -Wno-format-security -std=gnu89 -fno-PIE -mno-sse -mno-mmx -mno-sse2 -mno-3dnow -mno-avx -m64 -falign-jumps=1 -falign-loops=1 -mno-80387 -mno-fp-ret-in-387 -mpreferred-stack-boundary=3 -mskip-rax-setup -mtune=generic -mno-red-zone -mcmodel=kernel -funit-at-a-time -DCONFIG_X86_X32_ABI -DCONFIG_AS_CFI=1 -DCONFIG_AS_CFI_SIGNAL_FRAME=1 -DCONFIG_AS_CFI_SECTIONS=1 -DCONFIG_AS_FXSAVEQ=1 -DCONFIG_AS_SSSE3=1 -DCONFIG_AS_CRC32=1 -DCONFIG_AS_AVX=1 -DCONFIG_AS_AVX2=1 -DCONFIG_AS_AVX512=1 -DCONFIG_AS_SHA1_NI=1 -DCONFIG_AS_SHA256_NI=1 -pipe -Wno-sign-compare -fno-asynchronous-unwind-tables -mindirect-branch=thunk-extern -mindirect-branch-register -fno-jump-tables -fno-delete-null-pointer-checks -Wno-frame-address -Wno-format-truncation -Wno-format-overflow -Wno-int-in-bool-context -O2 --param=allow-store-data-races=0 -Wframe-larger-than=2048 -fstack-protector-strong -Wno-unused-but-set-variable -Wno-unused-const-variable -fno-var-tracking-assignments -g -pg -mrecord-mcount -mfentry -DCC_USING_FENTRY -Wdeclaration-after-statement -Wno-pointer-sign -Wno-stringop-truncation -fno-strict-overflow -fno-merge-all-constants -fmerge-constants -fno-stack-check -fconserve-stack -Werror=implicit-int -Werror=strict-prototypes -Werror=date-time -Werror=incompatible-pointer-types -Werror=designated-init -fmacro-prefix-map=/usr/src/linux-headers-4.19.0-9-common/= -fcf-protection=none -Wno-packed-not-aligned  -I/var/lib/dkms/nvidia-current/418.113/build/common/inc  -I/var/lib/dkms/nvidia-current/418.113/build -Wall -MD -Wno-cast-qual -Wno-error -Wno-format-extra-args -D__KERNEL__ -DMODULE -DNVRM -DNV_VERSION_STRING=\"418.113\" -Wno-unused-function -Wuninitialized -fno-strict-aliasing -mno-red-zone -mcmodel=kernel -DNV_UVM_ENABLE -Werror=undef -DNV_SPECTRE_V2=0 -O2 -DNVIDIA_UVM_ENABLED -DNVIDIA_UNDEF_LEGACY_BIT_MACROS -DLinux -D__linux__  -I/var/lib/dkms/nvidia-current/418.113/build/nvidia-uvm  -DMODULE  -DKBUILD_BASENAME='"uvm8_perf_thrashing"' -DKBUILD_MODNAME='"nvidia_uvm"' -c -o /var/lib/dkms/nvidia-current/418.113/build/nvidia-uvm/.tmp_uvm8_perf_thrashing.o /var/lib/dkms/nvidia-current/418.113/build/nvidia-uvm/uvm8_perf_thrashing.c
   ./tools/objtool/objtool orc generate  --module --no-fp --retpoline "/var/lib/dkms/nvidia-current/418.113/build/nvidia-uvm/.tmp_uvm8_perf_heuristics.o";
   gcc-8 -Wp,-MD,/var/lib/dkms/nvidia-current/418.113/build/nvidia-uvm/.uvm8_perf_prefetch.o.d  -nostdinc -isystem /usr/lib/gcc/x86_64-linux-gnu/8/include -I/usr/src/linux-headers-4.19.0-9-common/arch/x86/include -I./arch/x86/include/generated  -I/usr/src/linux-headers-4.19.0-9-common/include -I./include -I/usr/src/linux-headers-4.19.0-9-common/arch/x86/include/uapi -I./arch/x86/include/generated/uapi -I/usr/src/linux-headers-4.19.0-9-common/include/uapi -I./include/generated/uapi -include /usr/src/linux-headers-4.19.0-9-common/include/linux/kconfig.h -include /usr/src/linux-headers-4.19.0-9-common/include/linux/compiler_types.h  -I/var/lib/dkms/nvidia-current/418.113/build -I/var/lib/dkms/nvidia-current/418.113/build -D__KERNEL__ -Wall -Wundef -Wstrict-prototypes -Wno-trigraphs -fno-strict-aliasing -fno-common -fshort-wchar -Werror-implicit-function-declaration -Wno-format-security -std=gnu89 -fno-PIE -mno-sse -mno-mmx -mno-sse2 -mno-3dnow -mno-avx -m64 -falign-jumps=1 -falign-loops=1 -mno-80387 -mno-fp-ret-in-387 -mpreferred-stack-boundary=3 -mskip-rax-setup -mtune=generic -mno-red-zone -mcmodel=kernel -funit-at-a-time -DCONFIG_X86_X32_ABI -DCONFIG_AS_CFI=1 -DCONFIG_AS_CFI_SIGNAL_FRAME=1 -DCONFIG_AS_CFI_SECTIONS=1 -DCONFIG_AS_FXSAVEQ=1 -DCONFIG_AS_SSSE3=1 -DCONFIG_AS_CRC32=1 -DCONFIG_AS_AVX=1 -DCONFIG_AS_AVX2=1 -DCONFIG_AS_AVX512=1 -DCONFIG_AS_SHA1_NI=1 -DCONFIG_AS_SHA256_NI=1 -pipe -Wno-sign-compare -fno-asynchronous-unwind-tables -mindirect-branch=thunk-extern -mindirect-branch-register -fno-jump-tables -fno-delete-null-pointer-checks -Wno-frame-address -Wno-format-truncation -Wno-format-overflow -Wno-int-in-bool-context -O2 --param=allow-store-data-races=0 -Wframe-larger-than=2048 -fstack-protector-strong -Wno-unused-but-set-variable -Wno-unused-const-variable -fno-var-tracking-assignments -g -pg -mrecord-mcount -mfentry -DCC_USING_FENTRY -Wdeclaration-after-statement -Wno-pointer-sign -Wno-stringop-truncation -fno-strict-overflow -fno-merge-all-constants -fmerge-constants -fno-stack-check -fconserve-stack -Werror=implicit-int -Werror=strict-prototypes -Werror=date-time -Werror=incompatible-pointer-types -Werror=designated-init -fmacro-prefix-map=/usr/src/linux-headers-4.19.0-9-common/= -fcf-protection=none -Wno-packed-not-aligned  -I/var/lib/dkms/nvidia-current/418.113/build/common/inc  -I/var/lib/dkms/nvidia-current/418.113/build -Wall -MD -Wno-cast-qual -Wno-error -Wno-format-extra-args -D__KERNEL__ -DMODULE -DNVRM -DNV_VERSION_STRING=\"418.113\" -Wno-unused-function -Wuninitialized -fno-strict-aliasing -mno-red-zone -mcmodel=kernel -DNV_UVM_ENABLE -Werror=undef -DNV_SPECTRE_V2=0 -O2 -DNVIDIA_UVM_ENABLED -DNVIDIA_UNDEF_LEGACY_BIT_MACROS -DLinux -D__linux__  -I/var/lib/dkms/nvidia-current/418.113/build/nvidia-uvm  -DMODULE  -DKBUILD_BASENAME='"uvm8_perf_prefetch"' -DKBUILD_MODNAME='"nvidia_uvm"' -c -o /var/lib/dkms/nvidia-current/418.113/build/nvidia-uvm/.tmp_uvm8_perf_prefetch.o /var/lib/dkms/nvidia-current/418.113/build/nvidia-uvm/uvm8_perf_prefetch.c
   ./tools/objtool/objtool orc generate  --module --no-fp --retpoline "/var/lib/dkms/nvidia-current/418.113/build/nvidia-uvm/.tmp_uvm8_perf_thrashing.o";
   gcc-8 -Wp,-MD,/var/lib/dkms/nvidia-current/418.113/build/nvidia-uvm/.uvm8_ats_ibm.o.d  -nostdinc -isystem /usr/lib/gcc/x86_64-linux-gnu/8/include -I/usr/src/linux-headers-4.19.0-9-common/arch/x86/include -I./arch/x86/include/generated  -I/usr/src/linux-headers-4.19.0-9-common/include -I./include -I/usr/src/linux-headers-4.19.0-9-common/arch/x86/include/uapi -I./arch/x86/include/generated/uapi -I/usr/src/linux-headers-4.19.0-9-common/include/uapi -I./include/generated/uapi -include /usr/src/linux-headers-4.19.0-9-common/include/linux/kconfig.h -include /usr/src/linux-headers-4.19.0-9-common/include/linux/compiler_types.h  -I/var/lib/dkms/nvidia-current/418.113/build -I/var/lib/dkms/nvidia-current/418.113/build -D__KERNEL__ -Wall -Wundef -Wstrict-prototypes -Wno-trigraphs -fno-strict-aliasing -fno-common -fshort-wchar -Werror-implicit-function-declaration -Wno-format-security -std=gnu89 -fno-PIE -mno-sse -mno-mmx -mno-sse2 -mno-3dnow -mno-avx -m64 -falign-jumps=1 -falign-loops=1 -mno-80387 -mno-fp-ret-in-387 -mpreferred-stack-boundary=3 -mskip-rax-setup -mtune=generic -mno-red-zone -mcmodel=kernel -funit-at-a-time -DCONFIG_X86_X32_ABI -DCONFIG_AS_CFI=1 -DCONFIG_AS_CFI_SIGNAL_FRAME=1 -DCONFIG_AS_CFI_SECTIONS=1 -DCONFIG_AS_FXSAVEQ=1 -DCONFIG_AS_SSSE3=1 -DCONFIG_AS_CRC32=1 -DCONFIG_AS_AVX=1 -DCONFIG_AS_AVX2=1 -DCONFIG_AS_AVX512=1 -DCONFIG_AS_SHA1_NI=1 -DCONFIG_AS_SHA256_NI=1 -pipe -Wno-sign-compare -fno-asynchronous-unwind-tables -mindirect-branch=thunk-extern -mindirect-branch-register -fno-jump-tables -fno-delete-null-pointer-checks -Wno-frame-address -Wno-format-truncation -Wno-format-overflow -Wno-int-in-bool-context -O2 --param=allow-store-data-races=0 -Wframe-larger-than=2048 -fstack-protector-strong -Wno-unused-but-set-variable -Wno-unused-const-variable -fno-var-tracking-assignments -g -pg -mrecord-mcount -mfentry -DCC_USING_FENTRY -Wdeclaration-after-statement -Wno-pointer-sign -Wno-stringop-truncation -fno-strict-overflow -fno-merge-all-constants -fmerge-constants -fno-stack-check -fconserve-stack -Werror=implicit-int -Werror=strict-prototypes -Werror=date-time -Werror=incompatible-pointer-types -Werror=designated-init -fmacro-prefix-map=/usr/src/linux-headers-4.19.0-9-common/= -fcf-protection=none -Wno-packed-not-aligned  -I/var/lib/dkms/nvidia-current/418.113/build/common/inc  -I/var/lib/dkms/nvidia-current/418.113/build -Wall -MD -Wno-cast-qual -Wno-error -Wno-format-extra-args -D__KERNEL__ -DMODULE -DNVRM -DNV_VERSION_STRING=\"418.113\" -Wno-unused-function -Wuninitialized -fno-strict-aliasing -mno-red-zone -mcmodel=kernel -DNV_UVM_ENABLE -Werror=undef -DNV_SPECTRE_V2=0 -O2 -DNVIDIA_UVM_ENABLED -DNVIDIA_UNDEF_LEGACY_BIT_MACROS -DLinux -D__linux__  -I/var/lib/dkms/nvidia-current/418.113/build/nvidia-uvm  -DMODULE  -DKBUILD_BASENAME='"uvm8_ats_ibm"' -DKBUILD_MODNAME='"nvidia_uvm"' -c -o /var/lib/dkms/nvidia-current/418.113/build/nvidia-uvm/.tmp_uvm8_ats_ibm.o /var/lib/dkms/nvidia-current/418.113/build/nvidia-uvm/uvm8_ats_ibm.c
   ./tools/objtool/objtool orc generate  --module --no-fp --retpoline "/var/lib/dkms/nvidia-current/418.113/build/nvidia-uvm/.tmp_uvm8_perf_prefetch.o";
   gcc-8 -Wp,-MD,/var/lib/dkms/nvidia-current/418.113/build/nvidia-uvm/.uvm8_ats_faults.o.d  -nostdinc -isystem /usr/lib/gcc/x86_64-linux-gnu/8/include -I/usr/src/linux-headers-4.19.0-9-common/arch/x86/include -I./arch/x86/include/generated  -I/usr/src/linux-headers-4.19.0-9-common/include -I./include -I/usr/src/linux-headers-4.19.0-9-common/arch/x86/include/uapi -I./arch/x86/include/generated/uapi -I/usr/src/linux-headers-4.19.0-9-common/include/uapi -I./include/generated/uapi -include /usr/src/linux-headers-4.19.0-9-common/include/linux/kconfig.h -include /usr/src/linux-headers-4.19.0-9-common/include/linux/compiler_types.h  -I/var/lib/dkms/nvidia-current/418.113/build -I/var/lib/dkms/nvidia-current/418.113/build -D__KERNEL__ -Wall -Wundef -Wstrict-prototypes -Wno-trigraphs -fno-strict-aliasing -fno-common -fshort-wchar -Werror-implicit-function-declaration -Wno-format-security -std=gnu89 -fno-PIE -mno-sse -mno-mmx -mno-sse2 -mno-3dnow -mno-avx -m64 -falign-jumps=1 -falign-loops=1 -mno-80387 -mno-fp-ret-in-387 -mpreferred-stack-boundary=3 -mskip-rax-setup -mtune=generic -mno-red-zone -mcmodel=kernel -funit-at-a-time -DCONFIG_X86_X32_ABI -DCONFIG_AS_CFI=1 -DCONFIG_AS_CFI_SIGNAL_FRAME=1 -DCONFIG_AS_CFI_SECTIONS=1 -DCONFIG_AS_FXSAVEQ=1 -DCONFIG_AS_SSSE3=1 -DCONFIG_AS_CRC32=1 -DCONFIG_AS_AVX=1 -DCONFIG_AS_AVX2=1 -DCONFIG_AS_AVX512=1 -DCONFIG_AS_SHA1_NI=1 -DCONFIG_AS_SHA256_NI=1 -pipe -Wno-sign-compare -fno-asynchronous-unwind-tables -mindirect-branch=thunk-extern -mindirect-branch-register -fno-jump-tables -fno-delete-null-pointer-checks -Wno-frame-address -Wno-format-truncation -Wno-format-overflow -Wno-int-in-bool-context -O2 --param=allow-store-data-races=0 -Wframe-larger-than=2048 -fstack-protector-strong -Wno-unused-but-set-variable -Wno-unused-const-variable -fno-var-tracking-assignments -g -pg -mrecord-mcount -mfentry -DCC_USING_FENTRY -Wdeclaration-after-statement -Wno-pointer-sign -Wno-stringop-truncation -fno-strict-overflow -fno-merge-all-constants -fmerge-constants -fno-stack-check -fconserve-stack -Werror=implicit-int -Werror=strict-prototypes -Werror=date-time -Werror=incompatible-pointer-types -Werror=designated-init -fmacro-prefix-map=/usr/src/linux-headers-4.19.0-9-common/= -fcf-protection=none -Wno-packed-not-aligned  -I/var/lib/dkms/nvidia-current/418.113/build/common/inc  -I/var/lib/dkms/nvidia-current/418.113/build -Wall -MD -Wno-cast-qual -Wno-error -Wno-format-extra-args -D__KERNEL__ -DMODULE -DNVRM -DNV_VERSION_STRING=\"418.113\" -Wno-unused-function -Wuninitialized -fno-strict-aliasing -mno-red-zone -mcmodel=kernel -DNV_UVM_ENABLE -Werror=undef -DNV_SPECTRE_V2=0 -O2 -DNVIDIA_UVM_ENABLED -DNVIDIA_UNDEF_LEGACY_BIT_MACROS -DLinux -D__linux__  -I/var/lib/dkms/nvidia-current/418.113/build/nvidia-uvm  -DMODULE  -DKBUILD_BASENAME='"uvm8_ats_faults"' -DKBUILD_MODNAME='"nvidia_uvm"' -c -o /var/lib/dkms/nvidia-current/418.113/build/nvidia-uvm/.tmp_uvm8_ats_faults.o /var/lib/dkms/nvidia-current/418.113/build/nvidia-uvm/uvm8_ats_faults.c
   ./tools/objtool/objtool orc generate  --module --no-fp --retpoline "/var/lib/dkms/nvidia-current/418.113/build/nvidia-uvm/.tmp_uvm8_ats_ibm.o";
   gcc-8 -Wp,-MD,/var/lib/dkms/nvidia-current/418.113/build/nvidia-uvm/.uvm8_test.o.d  -nostdinc -isystem /usr/lib/gcc/x86_64-linux-gnu/8/include -I/usr/src/linux-headers-4.19.0-9-common/arch/x86/include -I./arch/x86/include/generated  -I/usr/src/linux-headers-4.19.0-9-common/include -I./include -I/usr/src/linux-headers-4.19.0-9-common/arch/x86/include/uapi -I./arch/x86/include/generated/uapi -I/usr/src/linux-headers-4.19.0-9-common/include/uapi -I./include/generated/uapi -include /usr/src/linux-headers-4.19.0-9-common/include/linux/kconfig.h -include /usr/src/linux-headers-4.19.0-9-common/include/linux/compiler_types.h  -I/var/lib/dkms/nvidia-current/418.113/build -I/var/lib/dkms/nvidia-current/418.113/build -D__KERNEL__ -Wall -Wundef -Wstrict-prototypes -Wno-trigraphs -fno-strict-aliasing -fno-common -fshort-wchar -Werror-implicit-function-declaration -Wno-format-security -std=gnu89 -fno-PIE -mno-sse -mno-mmx -mno-sse2 -mno-3dnow -mno-avx -m64 -falign-jumps=1 -falign-loops=1 -mno-80387 -mno-fp-ret-in-387 -mpreferred-stack-boundary=3 -mskip-rax-setup -mtune=generic -mno-red-zone -mcmodel=kernel -funit-at-a-time -DCONFIG_X86_X32_ABI -DCONFIG_AS_CFI=1 -DCONFIG_AS_CFI_SIGNAL_FRAME=1 -DCONFIG_AS_CFI_SECTIONS=1 -DCONFIG_AS_FXSAVEQ=1 -DCONFIG_AS_SSSE3=1 -DCONFIG_AS_CRC32=1 -DCONFIG_AS_AVX=1 -DCONFIG_AS_AVX2=1 -DCONFIG_AS_AVX512=1 -DCONFIG_AS_SHA1_NI=1 -DCONFIG_AS_SHA256_NI=1 -pipe -Wno-sign-compare -fno-asynchronous-unwind-tables -mindirect-branch=thunk-extern -mindirect-branch-register -fno-jump-tables -fno-delete-null-pointer-checks -Wno-frame-address -Wno-format-truncation -Wno-format-overflow -Wno-int-in-bool-context -O2 --param=allow-store-data-races=0 -Wframe-larger-than=2048 -fstack-protector-strong -Wno-unused-but-set-variable -Wno-unused-const-variable -fno-var-tracking-assignments -g -pg -mrecord-mcount -mfentry -DCC_USING_FENTRY -Wdeclaration-after-statement -Wno-pointer-sign -Wno-stringop-truncation -fno-strict-overflow -fno-merge-all-constants -fmerge-constants -fno-stack-check -fconserve-stack -Werror=implicit-int -Werror=strict-prototypes -Werror=date-time -Werror=incompatible-pointer-types -Werror=designated-init -fmacro-prefix-map=/usr/src/linux-headers-4.19.0-9-common/= -fcf-protection=none -Wno-packed-not-aligned  -I/var/lib/dkms/nvidia-current/418.113/build/common/inc  -I/var/lib/dkms/nvidia-current/418.113/build -Wall -MD -Wno-cast-qual -Wno-error -Wno-format-extra-args -D__KERNEL__ -DMODULE -DNVRM -DNV_VERSION_STRING=\"418.113\" -Wno-unused-function -Wuninitialized -fno-strict-aliasing -mno-red-zone -mcmodel=kernel -DNV_UVM_ENABLE -Werror=undef -DNV_SPECTRE_V2=0 -O2 -DNVIDIA_UVM_ENABLED -DNVIDIA_UNDEF_LEGACY_BIT_MACROS -DLinux -D__linux__  -I/var/lib/dkms/nvidia-current/418.113/build/nvidia-uvm  -DMODULE  -DKBUILD_BASENAME='"uvm8_test"' -DKBUILD_MODNAME='"nvidia_uvm"' -c -o /var/lib/dkms/nvidia-current/418.113/build/nvidia-uvm/.tmp_uvm8_test.o /var/lib/dkms/nvidia-current/418.113/build/nvidia-uvm/uvm8_test.c
   ./tools/objtool/objtool orc generate  --module --no-fp --retpoline "/var/lib/dkms/nvidia-current/418.113/build/nvidia-uvm/.tmp_uvm8_ats_faults.o";
   gcc-8 -Wp,-MD,/var/lib/dkms/nvidia-current/418.113/build/nvidia-uvm/.uvm8_test_rng.o.d  -nostdinc -isystem /usr/lib/gcc/x86_64-linux-gnu/8/include -I/usr/src/linux-headers-4.19.0-9-common/arch/x86/include -I./arch/x86/include/generated  -I/usr/src/linux-headers-4.19.0-9-common/include -I./include -I/usr/src/linux-headers-4.19.0-9-common/arch/x86/include/uapi -I./arch/x86/include/generated/uapi -I/usr/src/linux-headers-4.19.0-9-common/include/uapi -I./include/generated/uapi -include /usr/src/linux-headers-4.19.0-9-common/include/linux/kconfig.h -include /usr/src/linux-headers-4.19.0-9-common/include/linux/compiler_types.h  -I/var/lib/dkms/nvidia-current/418.113/build -I/var/lib/dkms/nvidia-current/418.113/build -D__KERNEL__ -Wall -Wundef -Wstrict-prototypes -Wno-trigraphs -fno-strict-aliasing -fno-common -fshort-wchar -Werror-implicit-function-declaration -Wno-format-security -std=gnu89 -fno-PIE -mno-sse -mno-mmx -mno-sse2 -mno-3dnow -mno-avx -m64 -falign-jumps=1 -falign-loops=1 -mno-80387 -mno-fp-ret-in-387 -mpreferred-stack-boundary=3 -mskip-rax-setup -mtune=generic -mno-red-zone -mcmodel=kernel -funit-at-a-time -DCONFIG_X86_X32_ABI -DCONFIG_AS_CFI=1 -DCONFIG_AS_CFI_SIGNAL_FRAME=1 -DCONFIG_AS_CFI_SECTIONS=1 -DCONFIG_AS_FXSAVEQ=1 -DCONFIG_AS_SSSE3=1 -DCONFIG_AS_CRC32=1 -DCONFIG_AS_AVX=1 -DCONFIG_AS_AVX2=1 -DCONFIG_AS_AVX512=1 -DCONFIG_AS_SHA1_NI=1 -DCONFIG_AS_SHA256_NI=1 -pipe -Wno-sign-compare -fno-asynchronous-unwind-tables -mindirect-branch=thunk-extern -mindirect-branch-register -fno-jump-tables -fno-delete-null-pointer-checks -Wno-frame-address -Wno-format-truncation -Wno-format-overflow -Wno-int-in-bool-context -O2 --param=allow-store-data-races=0 -Wframe-larger-than=2048 -fstack-protector-strong -Wno-unused-but-set-variable -Wno-unused-const-variable -fno-var-tracking-assignments -g -pg -mrecord-mcount -mfentry -DCC_USING_FENTRY -Wdeclaration-after-statement -Wno-pointer-sign -Wno-stringop-truncation -fno-strict-overflow -fno-merge-all-constants -fmerge-constants -fno-stack-check -fconserve-stack -Werror=implicit-int -Werror=strict-prototypes -Werror=date-time -Werror=incompatible-pointer-types -Werror=designated-init -fmacro-prefix-map=/usr/src/linux-headers-4.19.0-9-common/= -fcf-protection=none -Wno-packed-not-aligned  -I/var/lib/dkms/nvidia-current/418.113/build/common/inc  -I/var/lib/dkms/nvidia-current/418.113/build -Wall -MD -Wno-cast-qual -Wno-error -Wno-format-extra-args -D__KERNEL__ -DMODULE -DNVRM -DNV_VERSION_STRING=\"418.113\" -Wno-unused-function -Wuninitialized -fno-strict-aliasing -mno-red-zone -mcmodel=kernel -DNV_UVM_ENABLE -Werror=undef -DNV_SPECTRE_V2=0 -O2 -DNVIDIA_UVM_ENABLED -DNVIDIA_UNDEF_LEGACY_BIT_MACROS -DLinux -D__linux__  -I/var/lib/dkms/nvidia-current/418.113/build/nvidia-uvm  -DMODULE  -DKBUILD_BASENAME='"uvm8_test_rng"' -DKBUILD_MODNAME='"nvidia_uvm"' -c -o /var/lib/dkms/nvidia-current/418.113/build/nvidia-uvm/.tmp_uvm8_test_rng.o /var/lib/dkms/nvidia-current/418.113/build/nvidia-uvm/uvm8_test_rng.c
   ./tools/objtool/objtool orc generate  --module --no-fp --retpoline "/var/lib/dkms/nvidia-current/418.113/build/nvidia-uvm/.tmp_uvm8_test.o";
   ./tools/objtool/objtool orc generate  --module --no-fp --retpoline "/var/lib/dkms/nvidia-current/418.113/build/nvidia-uvm/.tmp_uvm8_test_rng.o";
   gcc-8 -Wp,-MD,/var/lib/dkms/nvidia-current/418.113/build/nvidia-uvm/.uvm8_range_tree_test.o.d  -nostdinc -isystem /usr/lib/gcc/x86_64-linux-gnu/8/include -I/usr/src/linux-headers-4.19.0-9-common/arch/x86/include -I./arch/x86/include/generated  -I/usr/src/linux-headers-4.19.0-9-common/include -I./include -I/usr/src/linux-headers-4.19.0-9-common/arch/x86/include/uapi -I./arch/x86/include/generated/uapi -I/usr/src/linux-headers-4.19.0-9-common/include/uapi -I./include/generated/uapi -include /usr/src/linux-headers-4.19.0-9-common/include/linux/kconfig.h -include /usr/src/linux-headers-4.19.0-9-common/include/linux/compiler_types.h  -I/var/lib/dkms/nvidia-current/418.113/build -I/var/lib/dkms/nvidia-current/418.113/build -D__KERNEL__ -Wall -Wundef -Wstrict-prototypes -Wno-trigraphs -fno-strict-aliasing -fno-common -fshort-wchar -Werror-implicit-function-declaration -Wno-format-security -std=gnu89 -fno-PIE -mno-sse -mno-mmx -mno-sse2 -mno-3dnow -mno-avx -m64 -falign-jumps=1 -falign-loops=1 -mno-80387 -mno-fp-ret-in-387 -mpreferred-stack-boundary=3 -mskip-rax-setup -mtune=generic -mno-red-zone -mcmodel=kernel -funit-at-a-time -DCONFIG_X86_X32_ABI -DCONFIG_AS_CFI=1 -DCONFIG_AS_CFI_SIGNAL_FRAME=1 -DCONFIG_AS_CFI_SECTIONS=1 -DCONFIG_AS_FXSAVEQ=1 -DCONFIG_AS_SSSE3=1 -DCONFIG_AS_CRC32=1 -DCONFIG_AS_AVX=1 -DCONFIG_AS_AVX2=1 -DCONFIG_AS_AVX512=1 -DCONFIG_AS_SHA1_NI=1 -DCONFIG_AS_SHA256_NI=1 -pipe -Wno-sign-compare -fno-asynchronous-unwind-tables -mindirect-branch=thunk-extern -mindirect-branch-register -fno-jump-tables -fno-delete-null-pointer-checks -Wno-frame-address -Wno-format-truncation -Wno-format-overflow -Wno-int-in-bool-context -O2 --param=allow-store-data-races=0 -Wframe-larger-than=2048 -fstack-protector-strong -Wno-unused-but-set-variable -Wno-unused-const-variable -fno-var-tracking-assignments -g -pg -mrecord-mcount -mfentry -DCC_USING_FENTRY -Wdeclaration-after-statement -Wno-pointer-sign -Wno-stringop-truncation -fno-strict-overflow -fno-merge-all-constants -fmerge-constants -fno-stack-check -fconserve-stack -Werror=implicit-int -Werror=strict-prototypes -Werror=date-time -Werror=incompatible-pointer-types -Werror=designated-init -fmacro-prefix-map=/usr/src/linux-headers-4.19.0-9-common/= -fcf-protection=none -Wno-packed-not-aligned  -I/var/lib/dkms/nvidia-current/418.113/build/common/inc  -I/var/lib/dkms/nvidia-current/418.113/build -Wall -MD -Wno-cast-qual -Wno-error -Wno-format-extra-args -D__KERNEL__ -DMODULE -DNVRM -DNV_VERSION_STRING=\"418.113\" -Wno-unused-function -Wuninitialized -fno-strict-aliasing -mno-red-zone -mcmodel=kernel -DNV_UVM_ENABLE -Werror=undef -DNV_SPECTRE_V2=0 -O2 -DNVIDIA_UVM_ENABLED -DNVIDIA_UNDEF_LEGACY_BIT_MACROS -DLinux -D__linux__  -I/var/lib/dkms/nvidia-current/418.113/build/nvidia-uvm  -DMODULE  -DKBUILD_BASENAME='"uvm8_range_tree_test"' -DKBUILD_MODNAME='"nvidia_uvm"' -c -o /var/lib/dkms/nvidia-current/418.113/build/nvidia-uvm/.tmp_uvm8_range_tree_test.o /var/lib/dkms/nvidia-current/418.113/build/nvidia-uvm/uvm8_range_tree_test.c
   gcc-8 -Wp,-MD,/var/lib/dkms/nvidia-current/418.113/build/nvidia-uvm/.uvm8_range_allocator_test.o.d  -nostdinc -isystem /usr/lib/gcc/x86_64-linux-gnu/8/include -I/usr/src/linux-headers-4.19.0-9-common/arch/x86/include -I./arch/x86/include/generated  -I/usr/src/linux-headers-4.19.0-9-common/include -I./include -I/usr/src/linux-headers-4.19.0-9-common/arch/x86/include/uapi -I./arch/x86/include/generated/uapi -I/usr/src/linux-headers-4.19.0-9-common/include/uapi -I./include/generated/uapi -include /usr/src/linux-headers-4.19.0-9-common/include/linux/kconfig.h -include /usr/src/linux-headers-4.19.0-9-common/include/linux/compiler_types.h  -I/var/lib/dkms/nvidia-current/418.113/build -I/var/lib/dkms/nvidia-current/418.113/build -D__KERNEL__ -Wall -Wundef -Wstrict-prototypes -Wno-trigraphs -fno-strict-aliasing -fno-common -fshort-wchar -Werror-implicit-function-declaration -Wno-format-security -std=gnu89 -fno-PIE -mno-sse -mno-mmx -mno-sse2 -mno-3dnow -mno-avx -m64 -falign-jumps=1 -falign-loops=1 -mno-80387 -mno-fp-ret-in-387 -mpreferred-stack-boundary=3 -mskip-rax-setup -mtune=generic -mno-red-zone -mcmodel=kernel -funit-at-a-time -DCONFIG_X86_X32_ABI -DCONFIG_AS_CFI=1 -DCONFIG_AS_CFI_SIGNAL_FRAME=1 -DCONFIG_AS_CFI_SECTIONS=1 -DCONFIG_AS_FXSAVEQ=1 -DCONFIG_AS_SSSE3=1 -DCONFIG_AS_CRC32=1 -DCONFIG_AS_AVX=1 -DCONFIG_AS_AVX2=1 -DCONFIG_AS_AVX512=1 -DCONFIG_AS_SHA1_NI=1 -DCONFIG_AS_SHA256_NI=1 -pipe -Wno-sign-compare -fno-asynchronous-unwind-tables -mindirect-branch=thunk-extern -mindirect-branch-register -fno-jump-tables -fno-delete-null-pointer-checks -Wno-frame-address -Wno-format-truncation -Wno-format-overflow -Wno-int-in-bool-context -O2 --param=allow-store-data-races=0 -Wframe-larger-than=2048 -fstack-protector-strong -Wno-unused-but-set-variable -Wno-unused-const-variable -fno-var-tracking-assignments -g -pg -mrecord-mcount -mfentry -DCC_USING_FENTRY -Wdeclaration-after-statement -Wno-pointer-sign -Wno-stringop-truncation -fno-strict-overflow -fno-merge-all-constants -fmerge-constants -fno-stack-check -fconserve-stack -Werror=implicit-int -Werror=strict-prototypes -Werror=date-time -Werror=incompatible-pointer-types -Werror=designated-init -fmacro-prefix-map=/usr/src/linux-headers-4.19.0-9-common/= -fcf-protection=none -Wno-packed-not-aligned  -I/var/lib/dkms/nvidia-current/418.113/build/common/inc  -I/var/lib/dkms/nvidia-current/418.113/build -Wall -MD -Wno-cast-qual -Wno-error -Wno-format-extra-args -D__KERNEL__ -DMODULE -DNVRM -DNV_VERSION_STRING=\"418.113\" -Wno-unused-function -Wuninitialized -fno-strict-aliasing -mno-red-zone -mcmodel=kernel -DNV_UVM_ENABLE -Werror=undef -DNV_SPECTRE_V2=0 -O2 -DNVIDIA_UVM_ENABLED -DNVIDIA_UNDEF_LEGACY_BIT_MACROS -DLinux -D__linux__  -I/var/lib/dkms/nvidia-current/418.113/build/nvidia-uvm  -DMODULE  -DKBUILD_BASENAME='"uvm8_range_allocator_test"' -DKBUILD_MODNAME='"nvidia_uvm"' -c -o /var/lib/dkms/nvidia-current/418.113/build/nvidia-uvm/.tmp_uvm8_range_allocator_test.o /var/lib/dkms/nvidia-current/418.113/build/nvidia-uvm/uvm8_range_allocator_test.c
   ./tools/objtool/objtool orc generate  --module --no-fp --retpoline "/var/lib/dkms/nvidia-current/418.113/build/nvidia-uvm/.tmp_uvm8_range_allocator_test.o";
   gcc-8 -Wp,-MD,/var/lib/dkms/nvidia-current/418.113/build/nvidia-uvm/.uvm8_gpu_semaphore_test.o.d  -nostdinc -isystem /usr/lib/gcc/x86_64-linux-gnu/8/include -I/usr/src/linux-headers-4.19.0-9-common/arch/x86/include -I./arch/x86/include/generated  -I/usr/src/linux-headers-4.19.0-9-common/include -I./include -I/usr/src/linux-headers-4.19.0-9-common/arch/x86/include/uapi -I./arch/x86/include/generated/uapi -I/usr/src/linux-headers-4.19.0-9-common/include/uapi -I./include/generated/uapi -include /usr/src/linux-headers-4.19.0-9-common/include/linux/kconfig.h -include /usr/src/linux-headers-4.19.0-9-common/include/linux/compiler_types.h  -I/var/lib/dkms/nvidia-current/418.113/build -I/var/lib/dkms/nvidia-current/418.113/build -D__KERNEL__ -Wall -Wundef -Wstrict-prototypes -Wno-trigraphs -fno-strict-aliasing -fno-common -fshort-wchar -Werror-implicit-function-declaration -Wno-format-security -std=gnu89 -fno-PIE -mno-sse -mno-mmx -mno-sse2 -mno-3dnow -mno-avx -m64 -falign-jumps=1 -falign-loops=1 -mno-80387 -mno-fp-ret-in-387 -mpreferred-stack-boundary=3 -mskip-rax-setup -mtune=generic -mno-red-zone -mcmodel=kernel -funit-at-a-time -DCONFIG_X86_X32_ABI -DCONFIG_AS_CFI=1 -DCONFIG_AS_CFI_SIGNAL_FRAME=1 -DCONFIG_AS_CFI_SECTIONS=1 -DCONFIG_AS_FXSAVEQ=1 -DCONFIG_AS_SSSE3=1 -DCONFIG_AS_CRC32=1 -DCONFIG_AS_AVX=1 -DCONFIG_AS_AVX2=1 -DCONFIG_AS_AVX512=1 -DCONFIG_AS_SHA1_NI=1 -DCONFIG_AS_SHA256_NI=1 -pipe -Wno-sign-compare -fno-asynchronous-unwind-tables -mindirect-branch=thunk-extern -mindirect-branch-register -fno-jump-tables -fno-delete-null-pointer-checks -Wno-frame-address -Wno-format-truncation -Wno-format-overflow -Wno-int-in-bool-context -O2 --param=allow-store-data-races=0 -Wframe-larger-than=2048 -fstack-protector-strong -Wno-unused-but-set-variable -Wno-unused-const-variable -fno-var-tracking-assignments -g -pg -mrecord-mcount -mfentry -DCC_USING_FENTRY -Wdeclaration-after-statement -Wno-pointer-sign -Wno-stringop-truncation -fno-strict-overflow -fno-merge-all-constants -fmerge-constants -fno-stack-check -fconserve-stack -Werror=implicit-int -Werror=strict-prototypes -Werror=date-time -Werror=incompatible-pointer-types -Werror=designated-init -fmacro-prefix-map=/usr/src/linux-headers-4.19.0-9-common/= -fcf-protection=none -Wno-packed-not-aligned  -I/var/lib/dkms/nvidia-current/418.113/build/common/inc  -I/var/lib/dkms/nvidia-current/418.113/build -Wall -MD -Wno-cast-qual -Wno-error -Wno-format-extra-args -D__KERNEL__ -DMODULE -DNVRM -DNV_VERSION_STRING=\"418.113\" -Wno-unused-function -Wuninitialized -fno-strict-aliasing -mno-red-zone -mcmodel=kernel -DNV_UVM_ENABLE -Werror=undef -DNV_SPECTRE_V2=0 -O2 -DNVIDIA_UVM_ENABLED -DNVIDIA_UNDEF_LEGACY_BIT_MACROS -DLinux -D__linux__  -I/var/lib/dkms/nvidia-current/418.113/build/nvidia-uvm  -DMODULE  -DKBUILD_BASENAME='"uvm8_gpu_semaphore_test"' -DKBUILD_MODNAME='"nvidia_uvm"' -c -o /var/lib/dkms/nvidia-current/418.113/build/nvidia-uvm/.tmp_uvm8_gpu_semaphore_test.o /var/lib/dkms/nvidia-current/418.113/build/nvidia-uvm/uvm8_gpu_semaphore_test.c
   ./tools/objtool/objtool orc generate  --module --no-fp --retpoline "/var/lib/dkms/nvidia-current/418.113/build/nvidia-uvm/.tmp_uvm8_range_tree_test.o";
   gcc-8 -Wp,-MD,/var/lib/dkms/nvidia-current/418.113/build/nvidia-uvm/.uvm8_mem_test.o.d  -nostdinc -isystem /usr/lib/gcc/x86_64-linux-gnu/8/include -I/usr/src/linux-headers-4.19.0-9-common/arch/x86/include -I./arch/x86/include/generated  -I/usr/src/linux-headers-4.19.0-9-common/include -I./include -I/usr/src/linux-headers-4.19.0-9-common/arch/x86/include/uapi -I./arch/x86/include/generated/uapi -I/usr/src/linux-headers-4.19.0-9-common/include/uapi -I./include/generated/uapi -include /usr/src/linux-headers-4.19.0-9-common/include/linux/kconfig.h -include /usr/src/linux-headers-4.19.0-9-common/include/linux/compiler_types.h  -I/var/lib/dkms/nvidia-current/418.113/build -I/var/lib/dkms/nvidia-current/418.113/build -D__KERNEL__ -Wall -Wundef -Wstrict-prototypes -Wno-trigraphs -fno-strict-aliasing -fno-common -fshort-wchar -Werror-implicit-function-declaration -Wno-format-security -std=gnu89 -fno-PIE -mno-sse -mno-mmx -mno-sse2 -mno-3dnow -mno-avx -m64 -falign-jumps=1 -falign-loops=1 -mno-80387 -mno-fp-ret-in-387 -mpreferred-stack-boundary=3 -mskip-rax-setup -mtune=generic -mno-red-zone -mcmodel=kernel -funit-at-a-time -DCONFIG_X86_X32_ABI -DCONFIG_AS_CFI=1 -DCONFIG_AS_CFI_SIGNAL_FRAME=1 -DCONFIG_AS_CFI_SECTIONS=1 -DCONFIG_AS_FXSAVEQ=1 -DCONFIG_AS_SSSE3=1 -DCONFIG_AS_CRC32=1 -DCONFIG_AS_AVX=1 -DCONFIG_AS_AVX2=1 -DCONFIG_AS_AVX512=1 -DCONFIG_AS_SHA1_NI=1 -DCONFIG_AS_SHA256_NI=1 -pipe -Wno-sign-compare -fno-asynchronous-unwind-tables -mindirect-branch=thunk-extern -mindirect-branch-register -fno-jump-tables -fno-delete-null-pointer-checks -Wno-frame-address -Wno-format-truncation -Wno-format-overflow -Wno-int-in-bool-context -O2 --param=allow-store-data-races=0 -Wframe-larger-than=2048 -fstack-protector-strong -Wno-unused-but-set-variable -Wno-unused-const-variable -fno-var-tracking-assignments -g -pg -mrecord-mcount -mfentry -DCC_USING_FENTRY -Wdeclaration-after-statement -Wno-pointer-sign -Wno-stringop-truncation -fno-strict-overflow -fno-merge-all-constants -fmerge-constants -fno-stack-check -fconserve-stack -Werror=implicit-int -Werror=strict-prototypes -Werror=date-time -Werror=incompatible-pointer-types -Werror=designated-init -fmacro-prefix-map=/usr/src/linux-headers-4.19.0-9-common/= -fcf-protection=none -Wno-packed-not-aligned  -I/var/lib/dkms/nvidia-current/418.113/build/common/inc  -I/var/lib/dkms/nvidia-current/418.113/build -Wall -MD -Wno-cast-qual -Wno-error -Wno-format-extra-args -D__KERNEL__ -DMODULE -DNVRM -DNV_VERSION_STRING=\"418.113\" -Wno-unused-function -Wuninitialized -fno-strict-aliasing -mno-red-zone -mcmodel=kernel -DNV_UVM_ENABLE -Werror=undef -DNV_SPECTRE_V2=0 -O2 -DNVIDIA_UVM_ENABLED -DNVIDIA_UNDEF_LEGACY_BIT_MACROS -DLinux -D__linux__  -I/var/lib/dkms/nvidia-current/418.113/build/nvidia-uvm  -DMODULE  -DKBUILD_BASENAME='"uvm8_mem_test"' -DKBUILD_MODNAME='"nvidia_uvm"' -c -o /var/lib/dkms/nvidia-current/418.113/build/nvidia-uvm/.tmp_uvm8_mem_test.o /var/lib/dkms/nvidia-current/418.113/build/nvidia-uvm/uvm8_mem_test.c
   ./tools/objtool/objtool orc generate  --module --no-fp --retpoline "/var/lib/dkms/nvidia-current/418.113/build/nvidia-uvm/.tmp_uvm8_gpu_semaphore_test.o";
   gcc-8 -Wp,-MD,/var/lib/dkms/nvidia-current/418.113/build/nvidia-uvm/.uvm8_rm_mem_test.o.d  -nostdinc -isystem /usr/lib/gcc/x86_64-linux-gnu/8/include -I/usr/src/linux-headers-4.19.0-9-common/arch/x86/include -I./arch/x86/include/generated  -I/usr/src/linux-headers-4.19.0-9-common/include -I./include -I/usr/src/linux-headers-4.19.0-9-common/arch/x86/include/uapi -I./arch/x86/include/generated/uapi -I/usr/src/linux-headers-4.19.0-9-common/include/uapi -I./include/generated/uapi -include /usr/src/linux-headers-4.19.0-9-common/include/linux/kconfig.h -include /usr/src/linux-headers-4.19.0-9-common/include/linux/compiler_types.h  -I/var/lib/dkms/nvidia-current/418.113/build -I/var/lib/dkms/nvidia-current/418.113/build -D__KERNEL__ -Wall -Wundef -Wstrict-prototypes -Wno-trigraphs -fno-strict-aliasing -fno-common -fshort-wchar -Werror-implicit-function-declaration -Wno-format-security -std=gnu89 -fno-PIE -mno-sse -mno-mmx -mno-sse2 -mno-3dnow -mno-avx -m64 -falign-jumps=1 -falign-loops=1 -mno-80387 -mno-fp-ret-in-387 -mpreferred-stack-boundary=3 -mskip-rax-setup -mtune=generic -mno-red-zone -mcmodel=kernel -funit-at-a-time -DCONFIG_X86_X32_ABI -DCONFIG_AS_CFI=1 -DCONFIG_AS_CFI_SIGNAL_FRAME=1 -DCONFIG_AS_CFI_SECTIONS=1 -DCONFIG_AS_FXSAVEQ=1 -DCONFIG_AS_SSSE3=1 -DCONFIG_AS_CRC32=1 -DCONFIG_AS_AVX=1 -DCONFIG_AS_AVX2=1 -DCONFIG_AS_AVX512=1 -DCONFIG_AS_SHA1_NI=1 -DCONFIG_AS_SHA256_NI=1 -pipe -Wno-sign-compare -fno-asynchronous-unwind-tables -mindirect-branch=thunk-extern -mindirect-branch-register -fno-jump-tables -fno-delete-null-pointer-checks -Wno-frame-address -Wno-format-truncation -Wno-format-overflow -Wno-int-in-bool-context -O2 --param=allow-store-data-races=0 -Wframe-larger-than=2048 -fstack-protector-strong -Wno-unused-but-set-variable -Wno-unused-const-variable -fno-var-tracking-assignments -g -pg -mrecord-mcount -mfentry -DCC_USING_FENTRY -Wdeclaration-after-statement -Wno-pointer-sign -Wno-stringop-truncation -fno-strict-overflow -fno-merge-all-constants -fmerge-constants -fno-stack-check -fconserve-stack -Werror=implicit-int -Werror=strict-prototypes -Werror=date-time -Werror=incompatible-pointer-types -Werror=designated-init -fmacro-prefix-map=/usr/src/linux-headers-4.19.0-9-common/= -fcf-protection=none -Wno-packed-not-aligned  -I/var/lib/dkms/nvidia-current/418.113/build/common/inc  -I/var/lib/dkms/nvidia-current/418.113/build -Wall -MD -Wno-cast-qual -Wno-error -Wno-format-extra-args -D__KERNEL__ -DMODULE -DNVRM -DNV_VERSION_STRING=\"418.113\" -Wno-unused-function -Wuninitialized -fno-strict-aliasing -mno-red-zone -mcmodel=kernel -DNV_UVM_ENABLE -Werror=undef -DNV_SPECTRE_V2=0 -O2 -DNVIDIA_UVM_ENABLED -DNVIDIA_UNDEF_LEGACY_BIT_MACROS -DLinux -D__linux__  -I/var/lib/dkms/nvidia-current/418.113/build/nvidia-uvm  -DMODULE  -DKBUILD_BASENAME='"uvm8_rm_mem_test"' -DKBUILD_MODNAME='"nvidia_uvm"' -c -o /var/lib/dkms/nvidia-current/418.113/build/nvidia-uvm/.tmp_uvm8_rm_mem_test.o /var/lib/dkms/nvidia-current/418.113/build/nvidia-uvm/uvm8_rm_mem_test.c
   ./tools/objtool/objtool orc generate  --module --no-fp --retpoline "/var/lib/dkms/nvidia-current/418.113/build/nvidia-uvm/.tmp_uvm8_mem_test.o";
   gcc-8 -Wp,-MD,/var/lib/dkms/nvidia-current/418.113/build/nvidia-uvm/.uvm8_page_tree_test.o.d  -nostdinc -isystem /usr/lib/gcc/x86_64-linux-gnu/8/include -I/usr/src/linux-headers-4.19.0-9-common/arch/x86/include -I./arch/x86/include/generated  -I/usr/src/linux-headers-4.19.0-9-common/include -I./include -I/usr/src/linux-headers-4.19.0-9-common/arch/x86/include/uapi -I./arch/x86/include/generated/uapi -I/usr/src/linux-headers-4.19.0-9-common/include/uapi -I./include/generated/uapi -include /usr/src/linux-headers-4.19.0-9-common/include/linux/kconfig.h -include /usr/src/linux-headers-4.19.0-9-common/include/linux/compiler_types.h  -I/var/lib/dkms/nvidia-current/418.113/build -I/var/lib/dkms/nvidia-current/418.113/build -D__KERNEL__ -Wall -Wundef -Wstrict-prototypes -Wno-trigraphs -fno-strict-aliasing -fno-common -fshort-wchar -Werror-implicit-function-declaration -Wno-format-security -std=gnu89 -fno-PIE -mno-sse -mno-mmx -mno-sse2 -mno-3dnow -mno-avx -m64 -falign-jumps=1 -falign-loops=1 -mno-80387 -mno-fp-ret-in-387 -mpreferred-stack-boundary=3 -mskip-rax-setup -mtune=generic -mno-red-zone -mcmodel=kernel -funit-at-a-time -DCONFIG_X86_X32_ABI -DCONFIG_AS_CFI=1 -DCONFIG_AS_CFI_SIGNAL_FRAME=1 -DCONFIG_AS_CFI_SECTIONS=1 -DCONFIG_AS_FXSAVEQ=1 -DCONFIG_AS_SSSE3=1 -DCONFIG_AS_CRC32=1 -DCONFIG_AS_AVX=1 -DCONFIG_AS_AVX2=1 -DCONFIG_AS_AVX512=1 -DCONFIG_AS_SHA1_NI=1 -DCONFIG_AS_SHA256_NI=1 -pipe -Wno-sign-compare -fno-asynchronous-unwind-tables -mindirect-branch=thunk-extern -mindirect-branch-register -fno-jump-tables -fno-delete-null-pointer-checks -Wno-frame-address -Wno-format-truncation -Wno-format-overflow -Wno-int-in-bool-context -O2 --param=allow-store-data-races=0 -Wframe-larger-than=2048 -fstack-protector-strong -Wno-unused-but-set-variable -Wno-unused-const-variable -fno-var-tracking-assignments -g -pg -mrecord-mcount -mfentry -DCC_USING_FENTRY -Wdeclaration-after-statement -Wno-pointer-sign -Wno-stringop-truncation -fno-strict-overflow -fno-merge-all-constants -fmerge-constants -fno-stack-check -fconserve-stack -Werror=implicit-int -Werror=strict-prototypes -Werror=date-time -Werror=incompatible-pointer-types -Werror=designated-init -fmacro-prefix-map=/usr/src/linux-headers-4.19.0-9-common/= -fcf-protection=none -Wno-packed-not-aligned  -I/var/lib/dkms/nvidia-current/418.113/build/common/inc  -I/var/lib/dkms/nvidia-current/418.113/build -Wall -MD -Wno-cast-qual -Wno-error -Wno-format-extra-args -D__KERNEL__ -DMODULE -DNVRM -DNV_VERSION_STRING=\"418.113\" -Wno-unused-function -Wuninitialized -fno-strict-aliasing -mno-red-zone -mcmodel=kernel -DNV_UVM_ENABLE -Werror=undef -DNV_SPECTRE_V2=0 -O2 -DNVIDIA_UVM_ENABLED -DNVIDIA_UNDEF_LEGACY_BIT_MACROS -DLinux -D__linux__  -I/var/lib/dkms/nvidia-current/418.113/build/nvidia-uvm  -DMODULE  -DKBUILD_BASENAME='"uvm8_page_tree_test"' -DKBUILD_MODNAME='"nvidia_uvm"' -c -o /var/lib/dkms/nvidia-current/418.113/build/nvidia-uvm/.tmp_uvm8_page_tree_test.o /var/lib/dkms/nvidia-current/418.113/build/nvidia-uvm/uvm8_page_tree_test.c
   ./tools/objtool/objtool orc generate  --module --no-fp --retpoline "/var/lib/dkms/nvidia-current/418.113/build/nvidia-uvm/.tmp_uvm8_rm_mem_test.o";
   gcc-8 -Wp,-MD,/var/lib/dkms/nvidia-current/418.113/build/nvidia-uvm/.uvm8_tracker_test.o.d  -nostdinc -isystem /usr/lib/gcc/x86_64-linux-gnu/8/include -I/usr/src/linux-headers-4.19.0-9-common/arch/x86/include -I./arch/x86/include/generated  -I/usr/src/linux-headers-4.19.0-9-common/include -I./include -I/usr/src/linux-headers-4.19.0-9-common/arch/x86/include/uapi -I./arch/x86/include/generated/uapi -I/usr/src/linux-headers-4.19.0-9-common/include/uapi -I./include/generated/uapi -include /usr/src/linux-headers-4.19.0-9-common/include/linux/kconfig.h -include /usr/src/linux-headers-4.19.0-9-common/include/linux/compiler_types.h  -I/var/lib/dkms/nvidia-current/418.113/build -I/var/lib/dkms/nvidia-current/418.113/build -D__KERNEL__ -Wall -Wundef -Wstrict-prototypes -Wno-trigraphs -fno-strict-aliasing -fno-common -fshort-wchar -Werror-implicit-function-declaration -Wno-format-security -std=gnu89 -fno-PIE -mno-sse -mno-mmx -mno-sse2 -mno-3dnow -mno-avx -m64 -falign-jumps=1 -falign-loops=1 -mno-80387 -mno-fp-ret-in-387 -mpreferred-stack-boundary=3 -mskip-rax-setup -mtune=generic -mno-red-zone -mcmodel=kernel -funit-at-a-time -DCONFIG_X86_X32_ABI -DCONFIG_AS_CFI=1 -DCONFIG_AS_CFI_SIGNAL_FRAME=1 -DCONFIG_AS_CFI_SECTIONS=1 -DCONFIG_AS_FXSAVEQ=1 -DCONFIG_AS_SSSE3=1 -DCONFIG_AS_CRC32=1 -DCONFIG_AS_AVX=1 -DCONFIG_AS_AVX2=1 -DCONFIG_AS_AVX512=1 -DCONFIG_AS_SHA1_NI=1 -DCONFIG_AS_SHA256_NI=1 -pipe -Wno-sign-compare -fno-asynchronous-unwind-tables -mindirect-branch=thunk-extern -mindirect-branch-register -fno-jump-tables -fno-delete-null-pointer-checks -Wno-frame-address -Wno-format-truncation -Wno-format-overflow -Wno-int-in-bool-context -O2 --param=allow-store-data-races=0 -Wframe-larger-than=2048 -fstack-protector-strong -Wno-unused-but-set-variable -Wno-unused-const-variable -fno-var-tracking-assignments -g -pg -mrecord-mcount -mfentry -DCC_USING_FENTRY -Wdeclaration-after-statement -Wno-pointer-sign -Wno-stringop-truncation -fno-strict-overflow -fno-merge-all-constants -fmerge-constants -fno-stack-check -fconserve-stack -Werror=implicit-int -Werror=strict-prototypes -Werror=date-time -Werror=incompatible-pointer-types -Werror=designated-init -fmacro-prefix-map=/usr/src/linux-headers-4.19.0-9-common/= -fcf-protection=none -Wno-packed-not-aligned  -I/var/lib/dkms/nvidia-current/418.113/build/common/inc  -I/var/lib/dkms/nvidia-current/418.113/build -Wall -MD -Wno-cast-qual -Wno-error -Wno-format-extra-args -D__KERNEL__ -DMODULE -DNVRM -DNV_VERSION_STRING=\"418.113\" -Wno-unused-function -Wuninitialized -fno-strict-aliasing -mno-red-zone -mcmodel=kernel -DNV_UVM_ENABLE -Werror=undef -DNV_SPECTRE_V2=0 -O2 -DNVIDIA_UVM_ENABLED -DNVIDIA_UNDEF_LEGACY_BIT_MACROS -DLinux -D__linux__  -I/var/lib/dkms/nvidia-current/418.113/build/nvidia-uvm  -DMODULE  -DKBUILD_BASENAME='"uvm8_tracker_test"' -DKBUILD_MODNAME='"nvidia_uvm"' -c -o /var/lib/dkms/nvidia-current/418.113/build/nvidia-uvm/.tmp_uvm8_tracker_test.o /var/lib/dkms/nvidia-current/418.113/build/nvidia-uvm/uvm8_tracker_test.c
   ./tools/objtool/objtool orc generate  --module --no-fp --retpoline "/var/lib/dkms/nvidia-current/418.113/build/nvidia-uvm/.tmp_uvm8_tracker_test.o";
   gcc-8 -Wp,-MD,/var/lib/dkms/nvidia-current/418.113/build/nvidia-uvm/.uvm8_push_test.o.d  -nostdinc -isystem /usr/lib/gcc/x86_64-linux-gnu/8/include -I/usr/src/linux-headers-4.19.0-9-common/arch/x86/include -I./arch/x86/include/generated  -I/usr/src/linux-headers-4.19.0-9-common/include -I./include -I/usr/src/linux-headers-4.19.0-9-common/arch/x86/include/uapi -I./arch/x86/include/generated/uapi -I/usr/src/linux-headers-4.19.0-9-common/include/uapi -I./include/generated/uapi -include /usr/src/linux-headers-4.19.0-9-common/include/linux/kconfig.h -include /usr/src/linux-headers-4.19.0-9-common/include/linux/compiler_types.h  -I/var/lib/dkms/nvidia-current/418.113/build -I/var/lib/dkms/nvidia-current/418.113/build -D__KERNEL__ -Wall -Wundef -Wstrict-prototypes -Wno-trigraphs -fno-strict-aliasing -fno-common -fshort-wchar -Werror-implicit-function-declaration -Wno-format-security -std=gnu89 -fno-PIE -mno-sse -mno-mmx -mno-sse2 -mno-3dnow -mno-avx -m64 -falign-jumps=1 -falign-loops=1 -mno-80387 -mno-fp-ret-in-387 -mpreferred-stack-boundary=3 -mskip-rax-setup -mtune=generic -mno-red-zone -mcmodel=kernel -funit-at-a-time -DCONFIG_X86_X32_ABI -DCONFIG_AS_CFI=1 -DCONFIG_AS_CFI_SIGNAL_FRAME=1 -DCONFIG_AS_CFI_SECTIONS=1 -DCONFIG_AS_FXSAVEQ=1 -DCONFIG_AS_SSSE3=1 -DCONFIG_AS_CRC32=1 -DCONFIG_AS_AVX=1 -DCONFIG_AS_AVX2=1 -DCONFIG_AS_AVX512=1 -DCONFIG_AS_SHA1_NI=1 -DCONFIG_AS_SHA256_NI=1 -pipe -Wno-sign-compare -fno-asynchronous-unwind-tables -mindirect-branch=thunk-extern -mindirect-branch-register -fno-jump-tables -fno-delete-null-pointer-checks -Wno-frame-address -Wno-format-truncation -Wno-format-overflow -Wno-int-in-bool-context -O2 --param=allow-store-data-races=0 -Wframe-larger-than=2048 -fstack-protector-strong -Wno-unused-but-set-variable -Wno-unused-const-variable -fno-var-tracking-assignments -g -pg -mrecord-mcount -mfentry -DCC_USING_FENTRY -Wdeclaration-after-statement -Wno-pointer-sign -Wno-stringop-truncation -fno-strict-overflow -fno-merge-all-constants -fmerge-constants -fno-stack-check -fconserve-stack -Werror=implicit-int -Werror=strict-prototypes -Werror=date-time -Werror=incompatible-pointer-types -Werror=designated-init -fmacro-prefix-map=/usr/src/linux-headers-4.19.0-9-common/= -fcf-protection=none -Wno-packed-not-aligned  -I/var/lib/dkms/nvidia-current/418.113/build/common/inc  -I/var/lib/dkms/nvidia-current/418.113/build -Wall -MD -Wno-cast-qual -Wno-error -Wno-format-extra-args -D__KERNEL__ -DMODULE -DNVRM -DNV_VERSION_STRING=\"418.113\" -Wno-unused-function -Wuninitialized -fno-strict-aliasing -mno-red-zone -mcmodel=kernel -DNV_UVM_ENABLE -Werror=undef -DNV_SPECTRE_V2=0 -O2 -DNVIDIA_UVM_ENABLED -DNVIDIA_UNDEF_LEGACY_BIT_MACROS -DLinux -D__linux__  -I/var/lib/dkms/nvidia-current/418.113/build/nvidia-uvm  -DMODULE  -DKBUILD_BASENAME='"uvm8_push_test"' -DKBUILD_MODNAME='"nvidia_uvm"' -c -o /var/lib/dkms/nvidia-current/418.113/build/nvidia-uvm/.tmp_uvm8_push_test.o /var/lib/dkms/nvidia-current/418.113/build/nvidia-uvm/uvm8_push_test.c
   ./tools/objtool/objtool orc generate  --module --no-fp --retpoline "/var/lib/dkms/nvidia-current/418.113/build/nvidia-uvm/.tmp_uvm8_page_tree_test.o";
   gcc-8 -Wp,-MD,/var/lib/dkms/nvidia-current/418.113/build/nvidia-uvm/.uvm8_channel_test.o.d  -nostdinc -isystem /usr/lib/gcc/x86_64-linux-gnu/8/include -I/usr/src/linux-headers-4.19.0-9-common/arch/x86/include -I./arch/x86/include/generated  -I/usr/src/linux-headers-4.19.0-9-common/include -I./include -I/usr/src/linux-headers-4.19.0-9-common/arch/x86/include/uapi -I./arch/x86/include/generated/uapi -I/usr/src/linux-headers-4.19.0-9-common/include/uapi -I./include/generated/uapi -include /usr/src/linux-headers-4.19.0-9-common/include/linux/kconfig.h -include /usr/src/linux-headers-4.19.0-9-common/include/linux/compiler_types.h  -I/var/lib/dkms/nvidia-current/418.113/build -I/var/lib/dkms/nvidia-current/418.113/build -D__KERNEL__ -Wall -Wundef -Wstrict-prototypes -Wno-trigraphs -fno-strict-aliasing -fno-common -fshort-wchar -Werror-implicit-function-declaration -Wno-format-security -std=gnu89 -fno-PIE -mno-sse -mno-mmx -mno-sse2 -mno-3dnow -mno-avx -m64 -falign-jumps=1 -falign-loops=1 -mno-80387 -mno-fp-ret-in-387 -mpreferred-stack-boundary=3 -mskip-rax-setup -mtune=generic -mno-red-zone -mcmodel=kernel -funit-at-a-time -DCONFIG_X86_X32_ABI -DCONFIG_AS_CFI=1 -DCONFIG_AS_CFI_SIGNAL_FRAME=1 -DCONFIG_AS_CFI_SECTIONS=1 -DCONFIG_AS_FXSAVEQ=1 -DCONFIG_AS_SSSE3=1 -DCONFIG_AS_CRC32=1 -DCONFIG_AS_AVX=1 -DCONFIG_AS_AVX2=1 -DCONFIG_AS_AVX512=1 -DCONFIG_AS_SHA1_NI=1 -DCONFIG_AS_SHA256_NI=1 -pipe -Wno-sign-compare -fno-asynchronous-unwind-tables -mindirect-branch=thunk-extern -mindirect-branch-register -fno-jump-tables -fno-delete-null-pointer-checks -Wno-frame-address -Wno-format-truncation -Wno-format-overflow -Wno-int-in-bool-context -O2 --param=allow-store-data-races=0 -Wframe-larger-than=2048 -fstack-protector-strong -Wno-unused-but-set-variable -Wno-unused-const-variable -fno-var-tracking-assignments -g -pg -mrecord-mcount -mfentry -DCC_USING_FENTRY -Wdeclaration-after-statement -Wno-pointer-sign -Wno-stringop-truncation -fno-strict-overflow -fno-merge-all-constants -fmerge-constants -fno-stack-check -fconserve-stack -Werror=implicit-int -Werror=strict-prototypes -Werror=date-time -Werror=incompatible-pointer-types -Werror=designated-init -fmacro-prefix-map=/usr/src/linux-headers-4.19.0-9-common/= -fcf-protection=none -Wno-packed-not-aligned  -I/var/lib/dkms/nvidia-current/418.113/build/common/inc  -I/var/lib/dkms/nvidia-current/418.113/build -Wall -MD -Wno-cast-qual -Wno-error -Wno-format-extra-args -D__KERNEL__ -DMODULE -DNVRM -DNV_VERSION_STRING=\"418.113\" -Wno-unused-function -Wuninitialized -fno-strict-aliasing -mno-red-zone -mcmodel=kernel -DNV_UVM_ENABLE -Werror=undef -DNV_SPECTRE_V2=0 -O2 -DNVIDIA_UVM_ENABLED -DNVIDIA_UNDEF_LEGACY_BIT_MACROS -DLinux -D__linux__  -I/var/lib/dkms/nvidia-current/418.113/build/nvidia-uvm  -DMODULE  -DKBUILD_BASENAME='"uvm8_channel_test"' -DKBUILD_MODNAME='"nvidia_uvm"' -c -o /var/lib/dkms/nvidia-current/418.113/build/nvidia-uvm/.tmp_uvm8_channel_test.o /var/lib/dkms/nvidia-current/418.113/build/nvidia-uvm/uvm8_channel_test.c
   ./tools/objtool/objtool orc generate  --module --no-fp --retpoline "/var/lib/dkms/nvidia-current/418.113/build/nvidia-uvm/.tmp_uvm8_push_test.o";
   gcc-8 -Wp,-MD,/var/lib/dkms/nvidia-current/418.113/build/nvidia-uvm/.uvm8_ce_test.o.d  -nostdinc -isystem /usr/lib/gcc/x86_64-linux-gnu/8/include -I/usr/src/linux-headers-4.19.0-9-common/arch/x86/include -I./arch/x86/include/generated  -I/usr/src/linux-headers-4.19.0-9-common/include -I./include -I/usr/src/linux-headers-4.19.0-9-common/arch/x86/include/uapi -I./arch/x86/include/generated/uapi -I/usr/src/linux-headers-4.19.0-9-common/include/uapi -I./include/generated/uapi -include /usr/src/linux-headers-4.19.0-9-common/include/linux/kconfig.h -include /usr/src/linux-headers-4.19.0-9-common/include/linux/compiler_types.h  -I/var/lib/dkms/nvidia-current/418.113/build -I/var/lib/dkms/nvidia-current/418.113/build -D__KERNEL__ -Wall -Wundef -Wstrict-prototypes -Wno-trigraphs -fno-strict-aliasing -fno-common -fshort-wchar -Werror-implicit-function-declaration -Wno-format-security -std=gnu89 -fno-PIE -mno-sse -mno-mmx -mno-sse2 -mno-3dnow -mno-avx -m64 -falign-jumps=1 -falign-loops=1 -mno-80387 -mno-fp-ret-in-387 -mpreferred-stack-boundary=3 -mskip-rax-setup -mtune=generic -mno-red-zone -mcmodel=kernel -funit-at-a-time -DCONFIG_X86_X32_ABI -DCONFIG_AS_CFI=1 -DCONFIG_AS_CFI_SIGNAL_FRAME=1 -DCONFIG_AS_CFI_SECTIONS=1 -DCONFIG_AS_FXSAVEQ=1 -DCONFIG_AS_SSSE3=1 -DCONFIG_AS_CRC32=1 -DCONFIG_AS_AVX=1 -DCONFIG_AS_AVX2=1 -DCONFIG_AS_AVX512=1 -DCONFIG_AS_SHA1_NI=1 -DCONFIG_AS_SHA256_NI=1 -pipe -Wno-sign-compare -fno-asynchronous-unwind-tables -mindirect-branch=thunk-extern -mindirect-branch-register -fno-jump-tables -fno-delete-null-pointer-checks -Wno-frame-address -Wno-format-truncation -Wno-format-overflow -Wno-int-in-bool-context -O2 --param=allow-store-data-races=0 -Wframe-larger-than=2048 -fstack-protector-strong -Wno-unused-but-set-variable -Wno-unused-const-variable -fno-var-tracking-assignments -g -pg -mrecord-mcount -mfentry -DCC_USING_FENTRY -Wdeclaration-after-statement -Wno-pointer-sign -Wno-stringop-truncation -fno-strict-overflow -fno-merge-all-constants -fmerge-constants -fno-stack-check -fconserve-stack -Werror=implicit-int -Werror=strict-prototypes -Werror=date-time -Werror=incompatible-pointer-types -Werror=designated-init -fmacro-prefix-map=/usr/src/linux-headers-4.19.0-9-common/= -fcf-protection=none -Wno-packed-not-aligned  -I/var/lib/dkms/nvidia-current/418.113/build/common/inc  -I/var/lib/dkms/nvidia-current/418.113/build -Wall -MD -Wno-cast-qual -Wno-error -Wno-format-extra-args -D__KERNEL__ -DMODULE -DNVRM -DNV_VERSION_STRING=\"418.113\" -Wno-unused-function -Wuninitialized -fno-strict-aliasing -mno-red-zone -mcmodel=kernel -DNV_UVM_ENABLE -Werror=undef -DNV_SPECTRE_V2=0 -O2 -DNVIDIA_UVM_ENABLED -DNVIDIA_UNDEF_LEGACY_BIT_MACROS -DLinux -D__linux__  -I/var/lib/dkms/nvidia-current/418.113/build/nvidia-uvm  -DMODULE  -DKBUILD_BASENAME='"uvm8_ce_test"' -DKBUILD_MODNAME='"nvidia_uvm"' -c -o /var/lib/dkms/nvidia-current/418.113/build/nvidia-uvm/.tmp_uvm8_ce_test.o /var/lib/dkms/nvidia-current/418.113/build/nvidia-uvm/uvm8_ce_test.c
   ./tools/objtool/objtool orc generate  --module --no-fp --retpoline "/var/lib/dkms/nvidia-current/418.113/build/nvidia-uvm/.tmp_uvm8_channel_test.o";
   gcc-8 -Wp,-MD,/var/lib/dkms/nvidia-current/418.113/build/nvidia-uvm/.uvm8_lock_test.o.d  -nostdinc -isystem /usr/lib/gcc/x86_64-linux-gnu/8/include -I/usr/src/linux-headers-4.19.0-9-common/arch/x86/include -I./arch/x86/include/generated  -I/usr/src/linux-headers-4.19.0-9-common/include -I./include -I/usr/src/linux-headers-4.19.0-9-common/arch/x86/include/uapi -I./arch/x86/include/generated/uapi -I/usr/src/linux-headers-4.19.0-9-common/include/uapi -I./include/generated/uapi -include /usr/src/linux-headers-4.19.0-9-common/include/linux/kconfig.h -include /usr/src/linux-headers-4.19.0-9-common/include/linux/compiler_types.h  -I/var/lib/dkms/nvidia-current/418.113/build -I/var/lib/dkms/nvidia-current/418.113/build -D__KERNEL__ -Wall -Wundef -Wstrict-prototypes -Wno-trigraphs -fno-strict-aliasing -fno-common -fshort-wchar -Werror-implicit-function-declaration -Wno-format-security -std=gnu89 -fno-PIE -mno-sse -mno-mmx -mno-sse2 -mno-3dnow -mno-avx -m64 -falign-jumps=1 -falign-loops=1 -mno-80387 -mno-fp-ret-in-387 -mpreferred-stack-boundary=3 -mskip-rax-setup -mtune=generic -mno-red-zone -mcmodel=kernel -funit-at-a-time -DCONFIG_X86_X32_ABI -DCONFIG_AS_CFI=1 -DCONFIG_AS_CFI_SIGNAL_FRAME=1 -DCONFIG_AS_CFI_SECTIONS=1 -DCONFIG_AS_FXSAVEQ=1 -DCONFIG_AS_SSSE3=1 -DCONFIG_AS_CRC32=1 -DCONFIG_AS_AVX=1 -DCONFIG_AS_AVX2=1 -DCONFIG_AS_AVX512=1 -DCONFIG_AS_SHA1_NI=1 -DCONFIG_AS_SHA256_NI=1 -pipe -Wno-sign-compare -fno-asynchronous-unwind-tables -mindirect-branch=thunk-extern -mindirect-branch-register -fno-jump-tables -fno-delete-null-pointer-checks -Wno-frame-address -Wno-format-truncation -Wno-format-overflow -Wno-int-in-bool-context -O2 --param=allow-store-data-races=0 -Wframe-larger-than=2048 -fstack-protector-strong -Wno-unused-but-set-variable -Wno-unused-const-variable -fno-var-tracking-assignments -g -pg -mrecord-mcount -mfentry -DCC_USING_FENTRY -Wdeclaration-after-statement -Wno-pointer-sign -Wno-stringop-truncation -fno-strict-overflow -fno-merge-all-constants -fmerge-constants -fno-stack-check -fconserve-stack -Werror=implicit-int -Werror=strict-prototypes -Werror=date-time -Werror=incompatible-pointer-types -Werror=designated-init -fmacro-prefix-map=/usr/src/linux-headers-4.19.0-9-common/= -fcf-protection=none -Wno-packed-not-aligned  -I/var/lib/dkms/nvidia-current/418.113/build/common/inc  -I/var/lib/dkms/nvidia-current/418.113/build -Wall -MD -Wno-cast-qual -Wno-error -Wno-format-extra-args -D__KERNEL__ -DMODULE -DNVRM -DNV_VERSION_STRING=\"418.113\" -Wno-unused-function -Wuninitialized -fno-strict-aliasing -mno-red-zone -mcmodel=kernel -DNV_UVM_ENABLE -Werror=undef -DNV_SPECTRE_V2=0 -O2 -DNVIDIA_UVM_ENABLED -DNVIDIA_UNDEF_LEGACY_BIT_MACROS -DLinux -D__linux__  -I/var/lib/dkms/nvidia-current/418.113/build/nvidia-uvm  -DMODULE  -DKBUILD_BASENAME='"uvm8_lock_test"' -DKBUILD_MODNAME='"nvidia_uvm"' -c -o /var/lib/dkms/nvidia-current/418.113/build/nvidia-uvm/.tmp_uvm8_lock_test.o /var/lib/dkms/nvidia-current/418.113/build/nvidia-uvm/uvm8_lock_test.c
   ./tools/objtool/objtool orc generate  --module --no-fp --retpoline "/var/lib/dkms/nvidia-current/418.113/build/nvidia-uvm/.tmp_uvm8_ce_test.o";
   gcc-8 -Wp,-MD,/var/lib/dkms/nvidia-current/418.113/build/nvidia-uvm/.uvm8_perf_utils_test.o.d  -nostdinc -isystem /usr/lib/gcc/x86_64-linux-gnu/8/include -I/usr/src/linux-headers-4.19.0-9-common/arch/x86/include -I./arch/x86/include/generated  -I/usr/src/linux-headers-4.19.0-9-common/include -I./include -I/usr/src/linux-headers-4.19.0-9-common/arch/x86/include/uapi -I./arch/x86/include/generated/uapi -I/usr/src/linux-headers-4.19.0-9-common/include/uapi -I./include/generated/uapi -include /usr/src/linux-headers-4.19.0-9-common/include/linux/kconfig.h -include /usr/src/linux-headers-4.19.0-9-common/include/linux/compiler_types.h  -I/var/lib/dkms/nvidia-current/418.113/build -I/var/lib/dkms/nvidia-current/418.113/build -D__KERNEL__ -Wall -Wundef -Wstrict-prototypes -Wno-trigraphs -fno-strict-aliasing -fno-common -fshort-wchar -Werror-implicit-function-declaration -Wno-format-security -std=gnu89 -fno-PIE -mno-sse -mno-mmx -mno-sse2 -mno-3dnow -mno-avx -m64 -falign-jumps=1 -falign-loops=1 -mno-80387 -mno-fp-ret-in-387 -mpreferred-stack-boundary=3 -mskip-rax-setup -mtune=generic -mno-red-zone -mcmodel=kernel -funit-at-a-time -DCONFIG_X86_X32_ABI -DCONFIG_AS_CFI=1 -DCONFIG_AS_CFI_SIGNAL_FRAME=1 -DCONFIG_AS_CFI_SECTIONS=1 -DCONFIG_AS_FXSAVEQ=1 -DCONFIG_AS_SSSE3=1 -DCONFIG_AS_CRC32=1 -DCONFIG_AS_AVX=1 -DCONFIG_AS_AVX2=1 -DCONFIG_AS_AVX512=1 -DCONFIG_AS_SHA1_NI=1 -DCONFIG_AS_SHA256_NI=1 -pipe -Wno-sign-compare -fno-asynchronous-unwind-tables -mindirect-branch=thunk-extern -mindirect-branch-register -fno-jump-tables -fno-delete-null-pointer-checks -Wno-frame-address -Wno-format-truncation -Wno-format-overflow -Wno-int-in-bool-context -O2 --param=allow-store-data-races=0 -Wframe-larger-than=2048 -fstack-protector-strong -Wno-unused-but-set-variable -Wno-unused-const-variable -fno-var-tracking-assignments -g -pg -mrecord-mcount -mfentry -DCC_USING_FENTRY -Wdeclaration-after-statement -Wno-pointer-sign -Wno-stringop-truncation -fno-strict-overflow -fno-merge-all-constants -fmerge-constants -fno-stack-check -fconserve-stack -Werror=implicit-int -Werror=strict-prototypes -Werror=date-time -Werror=incompatible-pointer-types -Werror=designated-init -fmacro-prefix-map=/usr/src/linux-headers-4.19.0-9-common/= -fcf-protection=none -Wno-packed-not-aligned  -I/var/lib/dkms/nvidia-current/418.113/build/common/inc  -I/var/lib/dkms/nvidia-current/418.113/build -Wall -MD -Wno-cast-qual -Wno-error -Wno-format-extra-args -D__KERNEL__ -DMODULE -DNVRM -DNV_VERSION_STRING=\"418.113\" -Wno-unused-function -Wuninitialized -fno-strict-aliasing -mno-red-zone -mcmodel=kernel -DNV_UVM_ENABLE -Werror=undef -DNV_SPECTRE_V2=0 -O2 -DNVIDIA_UVM_ENABLED -DNVIDIA_UNDEF_LEGACY_BIT_MACROS -DLinux -D__linux__  -I/var/lib/dkms/nvidia-current/418.113/build/nvidia-uvm  -DMODULE  -DKBUILD_BASENAME='"uvm8_perf_utils_test"' -DKBUILD_MODNAME='"nvidia_uvm"' -c -o /var/lib/dkms/nvidia-current/418.113/build/nvidia-uvm/.tmp_uvm8_perf_utils_test.o /var/lib/dkms/nvidia-current/418.113/build/nvidia-uvm/uvm8_perf_utils_test.c
   ./tools/objtool/objtool orc generate  --module --no-fp --retpoline "/var/lib/dkms/nvidia-current/418.113/build/nvidia-uvm/.tmp_uvm8_lock_test.o";
   gcc-8 -Wp,-MD,/var/lib/dkms/nvidia-current/418.113/build/nvidia-uvm/.uvm8_kvmalloc_test.o.d  -nostdinc -isystem /usr/lib/gcc/x86_64-linux-gnu/8/include -I/usr/src/linux-headers-4.19.0-9-common/arch/x86/include -I./arch/x86/include/generated  -I/usr/src/linux-headers-4.19.0-9-common/include -I./include -I/usr/src/linux-headers-4.19.0-9-common/arch/x86/include/uapi -I./arch/x86/include/generated/uapi -I/usr/src/linux-headers-4.19.0-9-common/include/uapi -I./include/generated/uapi -include /usr/src/linux-headers-4.19.0-9-common/include/linux/kconfig.h -include /usr/src/linux-headers-4.19.0-9-common/include/linux/compiler_types.h  -I/var/lib/dkms/nvidia-current/418.113/build -I/var/lib/dkms/nvidia-current/418.113/build -D__KERNEL__ -Wall -Wundef -Wstrict-prototypes -Wno-trigraphs -fno-strict-aliasing -fno-common -fshort-wchar -Werror-implicit-function-declaration -Wno-format-security -std=gnu89 -fno-PIE -mno-sse -mno-mmx -mno-sse2 -mno-3dnow -mno-avx -m64 -falign-jumps=1 -falign-loops=1 -mno-80387 -mno-fp-ret-in-387 -mpreferred-stack-boundary=3 -mskip-rax-setup -mtune=generic -mno-red-zone -mcmodel=kernel -funit-at-a-time -DCONFIG_X86_X32_ABI -DCONFIG_AS_CFI=1 -DCONFIG_AS_CFI_SIGNAL_FRAME=1 -DCONFIG_AS_CFI_SECTIONS=1 -DCONFIG_AS_FXSAVEQ=1 -DCONFIG_AS_SSSE3=1 -DCONFIG_AS_CRC32=1 -DCONFIG_AS_AVX=1 -DCONFIG_AS_AVX2=1 -DCONFIG_AS_AVX512=1 -DCONFIG_AS_SHA1_NI=1 -DCONFIG_AS_SHA256_NI=1 -pipe -Wno-sign-compare -fno-asynchronous-unwind-tables -mindirect-branch=thunk-extern -mindirect-branch-register -fno-jump-tables -fno-delete-null-pointer-checks -Wno-frame-address -Wno-format-truncation -Wno-format-overflow -Wno-int-in-bool-context -O2 --param=allow-store-data-races=0 -Wframe-larger-than=2048 -fstack-protector-strong -Wno-unused-but-set-variable -Wno-unused-const-variable -fno-var-tracking-assignments -g -pg -mrecord-mcount -mfentry -DCC_USING_FENTRY -Wdeclaration-after-statement -Wno-pointer-sign -Wno-stringop-truncation -fno-strict-overflow -fno-merge-all-constants -fmerge-constants -fno-stack-check -fconserve-stack -Werror=implicit-int -Werror=strict-prototypes -Werror=date-time -Werror=incompatible-pointer-types -Werror=designated-init -fmacro-prefix-map=/usr/src/linux-headers-4.19.0-9-common/= -fcf-protection=none -Wno-packed-not-aligned  -I/var/lib/dkms/nvidia-current/418.113/build/common/inc  -I/var/lib/dkms/nvidia-current/418.113/build -Wall -MD -Wno-cast-qual -Wno-error -Wno-format-extra-args -D__KERNEL__ -DMODULE -DNVRM -DNV_VERSION_STRING=\"418.113\" -Wno-unused-function -Wuninitialized -fno-strict-aliasing -mno-red-zone -mcmodel=kernel -DNV_UVM_ENABLE -Werror=undef -DNV_SPECTRE_V2=0 -O2 -DNVIDIA_UVM_ENABLED -DNVIDIA_UNDEF_LEGACY_BIT_MACROS -DLinux -D__linux__  -I/var/lib/dkms/nvidia-current/418.113/build/nvidia-uvm  -DMODULE  -DKBUILD_BASENAME='"uvm8_kvmalloc_test"' -DKBUILD_MODNAME='"nvidia_uvm"' -c -o /var/lib/dkms/nvidia-current/418.113/build/nvidia-uvm/.tmp_uvm8_kvmalloc_test.o /var/lib/dkms/nvidia-current/418.113/build/nvidia-uvm/uvm8_kvmalloc_test.c
   ./tools/objtool/objtool orc generate  --module --no-fp --retpoline "/var/lib/dkms/nvidia-current/418.113/build/nvidia-uvm/.tmp_uvm8_kvmalloc_test.o";
   gcc-8 -Wp,-MD,/var/lib/dkms/nvidia-current/418.113/build/nvidia-uvm/.uvm8_pmm_test.o.d  -nostdinc -isystem /usr/lib/gcc/x86_64-linux-gnu/8/include -I/usr/src/linux-headers-4.19.0-9-common/arch/x86/include -I./arch/x86/include/generated  -I/usr/src/linux-headers-4.19.0-9-common/include -I./include -I/usr/src/linux-headers-4.19.0-9-common/arch/x86/include/uapi -I./arch/x86/include/generated/uapi -I/usr/src/linux-headers-4.19.0-9-common/include/uapi -I./include/generated/uapi -include /usr/src/linux-headers-4.19.0-9-common/include/linux/kconfig.h -include /usr/src/linux-headers-4.19.0-9-common/include/linux/compiler_types.h  -I/var/lib/dkms/nvidia-current/418.113/build -I/var/lib/dkms/nvidia-current/418.113/build -D__KERNEL__ -Wall -Wundef -Wstrict-prototypes -Wno-trigraphs -fno-strict-aliasing -fno-common -fshort-wchar -Werror-implicit-function-declaration -Wno-format-security -std=gnu89 -fno-PIE -mno-sse -mno-mmx -mno-sse2 -mno-3dnow -mno-avx -m64 -falign-jumps=1 -falign-loops=1 -mno-80387 -mno-fp-ret-in-387 -mpreferred-stack-boundary=3 -mskip-rax-setup -mtune=generic -mno-red-zone -mcmodel=kernel -funit-at-a-time -DCONFIG_X86_X32_ABI -DCONFIG_AS_CFI=1 -DCONFIG_AS_CFI_SIGNAL_FRAME=1 -DCONFIG_AS_CFI_SECTIONS=1 -DCONFIG_AS_FXSAVEQ=1 -DCONFIG_AS_SSSE3=1 -DCONFIG_AS_CRC32=1 -DCONFIG_AS_AVX=1 -DCONFIG_AS_AVX2=1 -DCONFIG_AS_AVX512=1 -DCONFIG_AS_SHA1_NI=1 -DCONFIG_AS_SHA256_NI=1 -pipe -Wno-sign-compare -fno-asynchronous-unwind-tables -mindirect-branch=thunk-extern -mindirect-branch-register -fno-jump-tables -fno-delete-null-pointer-checks -Wno-frame-address -Wno-format-truncation -Wno-format-overflow -Wno-int-in-bool-context -O2 --param=allow-store-data-races=0 -Wframe-larger-than=2048 -fstack-protector-strong -Wno-unused-but-set-variable -Wno-unused-const-variable -fno-var-tracking-assignments -g -pg -mrecord-mcount -mfentry -DCC_USING_FENTRY -Wdeclaration-after-statement -Wno-pointer-sign -Wno-stringop-truncation -fno-strict-overflow -fno-merge-all-constants -fmerge-constants -fno-stack-check -fconserve-stack -Werror=implicit-int -Werror=strict-prototypes -Werror=date-time -Werror=incompatible-pointer-types -Werror=designated-init -fmacro-prefix-map=/usr/src/linux-headers-4.19.0-9-common/= -fcf-protection=none -Wno-packed-not-aligned  -I/var/lib/dkms/nvidia-current/418.113/build/common/inc  -I/var/lib/dkms/nvidia-current/418.113/build -Wall -MD -Wno-cast-qual -Wno-error -Wno-format-extra-args -D__KERNEL__ -DMODULE -DNVRM -DNV_VERSION_STRING=\"418.113\" -Wno-unused-function -Wuninitialized -fno-strict-aliasing -mno-red-zone -mcmodel=kernel -DNV_UVM_ENABLE -Werror=undef -DNV_SPECTRE_V2=0 -O2 -DNVIDIA_UVM_ENABLED -DNVIDIA_UNDEF_LEGACY_BIT_MACROS -DLinux -D__linux__  -I/var/lib/dkms/nvidia-current/418.113/build/nvidia-uvm  -DMODULE  -DKBUILD_BASENAME='"uvm8_pmm_test"' -DKBUILD_MODNAME='"nvidia_uvm"' -c -o /var/lib/dkms/nvidia-current/418.113/build/nvidia-uvm/.tmp_uvm8_pmm_test.o /var/lib/dkms/nvidia-current/418.113/build/nvidia-uvm/uvm8_pmm_test.c
   ./tools/objtool/objtool orc generate  --module --no-fp --retpoline "/var/lib/dkms/nvidia-current/418.113/build/nvidia-uvm/.tmp_uvm8_perf_utils_test.o";
   gcc-8 -Wp,-MD,/var/lib/dkms/nvidia-current/418.113/build/nvidia-uvm/.uvm8_pmm_sysmem_test.o.d  -nostdinc -isystem /usr/lib/gcc/x86_64-linux-gnu/8/include -I/usr/src/linux-headers-4.19.0-9-common/arch/x86/include -I./arch/x86/include/generated  -I/usr/src/linux-headers-4.19.0-9-common/include -I./include -I/usr/src/linux-headers-4.19.0-9-common/arch/x86/include/uapi -I./arch/x86/include/generated/uapi -I/usr/src/linux-headers-4.19.0-9-common/include/uapi -I./include/generated/uapi -include /usr/src/linux-headers-4.19.0-9-common/include/linux/kconfig.h -include /usr/src/linux-headers-4.19.0-9-common/include/linux/compiler_types.h  -I/var/lib/dkms/nvidia-current/418.113/build -I/var/lib/dkms/nvidia-current/418.113/build -D__KERNEL__ -Wall -Wundef -Wstrict-prototypes -Wno-trigraphs -fno-strict-aliasing -fno-common -fshort-wchar -Werror-implicit-function-declaration -Wno-format-security -std=gnu89 -fno-PIE -mno-sse -mno-mmx -mno-sse2 -mno-3dnow -mno-avx -m64 -falign-jumps=1 -falign-loops=1 -mno-80387 -mno-fp-ret-in-387 -mpreferred-stack-boundary=3 -mskip-rax-setup -mtune=generic -mno-red-zone -mcmodel=kernel -funit-at-a-time -DCONFIG_X86_X32_ABI -DCONFIG_AS_CFI=1 -DCONFIG_AS_CFI_SIGNAL_FRAME=1 -DCONFIG_AS_CFI_SECTIONS=1 -DCONFIG_AS_FXSAVEQ=1 -DCONFIG_AS_SSSE3=1 -DCONFIG_AS_CRC32=1 -DCONFIG_AS_AVX=1 -DCONFIG_AS_AVX2=1 -DCONFIG_AS_AVX512=1 -DCONFIG_AS_SHA1_NI=1 -DCONFIG_AS_SHA256_NI=1 -pipe -Wno-sign-compare -fno-asynchronous-unwind-tables -mindirect-branch=thunk-extern -mindirect-branch-register -fno-jump-tables -fno-delete-null-pointer-checks -Wno-frame-address -Wno-format-truncation -Wno-format-overflow -Wno-int-in-bool-context -O2 --param=allow-store-data-races=0 -Wframe-larger-than=2048 -fstack-protector-strong -Wno-unused-but-set-variable -Wno-unused-const-variable -fno-var-tracking-assignments -g -pg -mrecord-mcount -mfentry -DCC_USING_FENTRY -Wdeclaration-after-statement -Wno-pointer-sign -Wno-stringop-truncation -fno-strict-overflow -fno-merge-all-constants -fmerge-constants -fno-stack-check -fconserve-stack -Werror=implicit-int -Werror=strict-prototypes -Werror=date-time -Werror=incompatible-pointer-types -Werror=designated-init -fmacro-prefix-map=/usr/src/linux-headers-4.19.0-9-common/= -fcf-protection=none -Wno-packed-not-aligned  -I/var/lib/dkms/nvidia-current/418.113/build/common/inc  -I/var/lib/dkms/nvidia-current/418.113/build -Wall -MD -Wno-cast-qual -Wno-error -Wno-format-extra-args -D__KERNEL__ -DMODULE -DNVRM -DNV_VERSION_STRING=\"418.113\" -Wno-unused-function -Wuninitialized -fno-strict-aliasing -mno-red-zone -mcmodel=kernel -DNV_UVM_ENABLE -Werror=undef -DNV_SPECTRE_V2=0 -O2 -DNVIDIA_UVM_ENABLED -DNVIDIA_UNDEF_LEGACY_BIT_MACROS -DLinux -D__linux__  -I/var/lib/dkms/nvidia-current/418.113/build/nvidia-uvm  -DMODULE  -DKBUILD_BASENAME='"uvm8_pmm_sysmem_test"' -DKBUILD_MODNAME='"nvidia_uvm"' -c -o /var/lib/dkms/nvidia-current/418.113/build/nvidia-uvm/.tmp_uvm8_pmm_sysmem_test.o /var/lib/dkms/nvidia-current/418.113/build/nvidia-uvm/uvm8_pmm_sysmem_test.c
   ./tools/objtool/objtool orc generate  --module --no-fp --retpoline "/var/lib/dkms/nvidia-current/418.113/build/nvidia-uvm/.tmp_uvm8_pmm_test.o";
   gcc-8 -Wp,-MD,/var/lib/dkms/nvidia-current/418.113/build/nvidia-uvm/.uvm8_perf_events_test.o.d  -nostdinc -isystem /usr/lib/gcc/x86_64-linux-gnu/8/include -I/usr/src/linux-headers-4.19.0-9-common/arch/x86/include -I./arch/x86/include/generated  -I/usr/src/linux-headers-4.19.0-9-common/include -I./include -I/usr/src/linux-headers-4.19.0-9-common/arch/x86/include/uapi -I./arch/x86/include/generated/uapi -I/usr/src/linux-headers-4.19.0-9-common/include/uapi -I./include/generated/uapi -include /usr/src/linux-headers-4.19.0-9-common/include/linux/kconfig.h -include /usr/src/linux-headers-4.19.0-9-common/include/linux/compiler_types.h  -I/var/lib/dkms/nvidia-current/418.113/build -I/var/lib/dkms/nvidia-current/418.113/build -D__KERNEL__ -Wall -Wundef -Wstrict-prototypes -Wno-trigraphs -fno-strict-aliasing -fno-common -fshort-wchar -Werror-implicit-function-declaration -Wno-format-security -std=gnu89 -fno-PIE -mno-sse -mno-mmx -mno-sse2 -mno-3dnow -mno-avx -m64 -falign-jumps=1 -falign-loops=1 -mno-80387 -mno-fp-ret-in-387 -mpreferred-stack-boundary=3 -mskip-rax-setup -mtune=generic -mno-red-zone -mcmodel=kernel -funit-at-a-time -DCONFIG_X86_X32_ABI -DCONFIG_AS_CFI=1 -DCONFIG_AS_CFI_SIGNAL_FRAME=1 -DCONFIG_AS_CFI_SECTIONS=1 -DCONFIG_AS_FXSAVEQ=1 -DCONFIG_AS_SSSE3=1 -DCONFIG_AS_CRC32=1 -DCONFIG_AS_AVX=1 -DCONFIG_AS_AVX2=1 -DCONFIG_AS_AVX512=1 -DCONFIG_AS_SHA1_NI=1 -DCONFIG_AS_SHA256_NI=1 -pipe -Wno-sign-compare -fno-asynchronous-unwind-tables -mindirect-branch=thunk-extern -mindirect-branch-register -fno-jump-tables -fno-delete-null-pointer-checks -Wno-frame-address -Wno-format-truncation -Wno-format-overflow -Wno-int-in-bool-context -O2 --param=allow-store-data-races=0 -Wframe-larger-than=2048 -fstack-protector-strong -Wno-unused-but-set-variable -Wno-unused-const-variable -fno-var-tracking-assignments -g -pg -mrecord-mcount -mfentry -DCC_USING_FENTRY -Wdeclaration-after-statement -Wno-pointer-sign -Wno-stringop-truncation -fno-strict-overflow -fno-merge-all-constants -fmerge-constants -fno-stack-check -fconserve-stack -Werror=implicit-int -Werror=strict-prototypes -Werror=date-time -Werror=incompatible-pointer-types -Werror=designated-init -fmacro-prefix-map=/usr/src/linux-headers-4.19.0-9-common/= -fcf-protection=none -Wno-packed-not-aligned  -I/var/lib/dkms/nvidia-current/418.113/build/common/inc  -I/var/lib/dkms/nvidia-current/418.113/build -Wall -MD -Wno-cast-qual -Wno-error -Wno-format-extra-args -D__KERNEL__ -DMODULE -DNVRM -DNV_VERSION_STRING=\"418.113\" -Wno-unused-function -Wuninitialized -fno-strict-aliasing -mno-red-zone -mcmodel=kernel -DNV_UVM_ENABLE -Werror=undef -DNV_SPECTRE_V2=0 -O2 -DNVIDIA_UVM_ENABLED -DNVIDIA_UNDEF_LEGACY_BIT_MACROS -DLinux -D__linux__  -I/var/lib/dkms/nvidia-current/418.113/build/nvidia-uvm  -DMODULE  -DKBUILD_BASENAME='"uvm8_perf_events_test"' -DKBUILD_MODNAME='"nvidia_uvm"' -c -o /var/lib/dkms/nvidia-current/418.113/build/nvidia-uvm/.tmp_uvm8_perf_events_test.o /var/lib/dkms/nvidia-current/418.113/build/nvidia-uvm/uvm8_perf_events_test.c
   ./tools/objtool/objtool orc generate  --module --no-fp --retpoline "/var/lib/dkms/nvidia-current/418.113/build/nvidia-uvm/.tmp_uvm8_pmm_sysmem_test.o";
   gcc-8 -Wp,-MD,/var/lib/dkms/nvidia-current/418.113/build/nvidia-uvm/.uvm8_perf_module_test.o.d  -nostdinc -isystem /usr/lib/gcc/x86_64-linux-gnu/8/include -I/usr/src/linux-headers-4.19.0-9-common/arch/x86/include -I./arch/x86/include/generated  -I/usr/src/linux-headers-4.19.0-9-common/include -I./include -I/usr/src/linux-headers-4.19.0-9-common/arch/x86/include/uapi -I./arch/x86/include/generated/uapi -I/usr/src/linux-headers-4.19.0-9-common/include/uapi -I./include/generated/uapi -include /usr/src/linux-headers-4.19.0-9-common/include/linux/kconfig.h -include /usr/src/linux-headers-4.19.0-9-common/include/linux/compiler_types.h  -I/var/lib/dkms/nvidia-current/418.113/build -I/var/lib/dkms/nvidia-current/418.113/build -D__KERNEL__ -Wall -Wundef -Wstrict-prototypes -Wno-trigraphs -fno-strict-aliasing -fno-common -fshort-wchar -Werror-implicit-function-declaration -Wno-format-security -std=gnu89 -fno-PIE -mno-sse -mno-mmx -mno-sse2 -mno-3dnow -mno-avx -m64 -falign-jumps=1 -falign-loops=1 -mno-80387 -mno-fp-ret-in-387 -mpreferred-stack-boundary=3 -mskip-rax-setup -mtune=generic -mno-red-zone -mcmodel=kernel -funit-at-a-time -DCONFIG_X86_X32_ABI -DCONFIG_AS_CFI=1 -DCONFIG_AS_CFI_SIGNAL_FRAME=1 -DCONFIG_AS_CFI_SECTIONS=1 -DCONFIG_AS_FXSAVEQ=1 -DCONFIG_AS_SSSE3=1 -DCONFIG_AS_CRC32=1 -DCONFIG_AS_AVX=1 -DCONFIG_AS_AVX2=1 -DCONFIG_AS_AVX512=1 -DCONFIG_AS_SHA1_NI=1 -DCONFIG_AS_SHA256_NI=1 -pipe -Wno-sign-compare -fno-asynchronous-unwind-tables -mindirect-branch=thunk-extern -mindirect-branch-register -fno-jump-tables -fno-delete-null-pointer-checks -Wno-frame-address -Wno-format-truncation -Wno-format-overflow -Wno-int-in-bool-context -O2 --param=allow-store-data-races=0 -Wframe-larger-than=2048 -fstack-protector-strong -Wno-unused-but-set-variable -Wno-unused-const-variable -fno-var-tracking-assignments -g -pg -mrecord-mcount -mfentry -DCC_USING_FENTRY -Wdeclaration-after-statement -Wno-pointer-sign -Wno-stringop-truncation -fno-strict-overflow -fno-merge-all-constants -fmerge-constants -fno-stack-check -fconserve-stack -Werror=implicit-int -Werror=strict-prototypes -Werror=date-time -Werror=incompatible-pointer-types -Werror=designated-init -fmacro-prefix-map=/usr/src/linux-headers-4.19.0-9-common/= -fcf-protection=none -Wno-packed-not-aligned  -I/var/lib/dkms/nvidia-current/418.113/build/common/inc  -I/var/lib/dkms/nvidia-current/418.113/build -Wall -MD -Wno-cast-qual -Wno-error -Wno-format-extra-args -D__KERNEL__ -DMODULE -DNVRM -DNV_VERSION_STRING=\"418.113\" -Wno-unused-function -Wuninitialized -fno-strict-aliasing -mno-red-zone -mcmodel=kernel -DNV_UVM_ENABLE -Werror=undef -DNV_SPECTRE_V2=0 -O2 -DNVIDIA_UVM_ENABLED -DNVIDIA_UNDEF_LEGACY_BIT_MACROS -DLinux -D__linux__  -I/var/lib/dkms/nvidia-current/418.113/build/nvidia-uvm  -DMODULE  -DKBUILD_BASENAME='"uvm8_perf_module_test"' -DKBUILD_MODNAME='"nvidia_uvm"' -c -o /var/lib/dkms/nvidia-current/418.113/build/nvidia-uvm/.tmp_uvm8_perf_module_test.o /var/lib/dkms/nvidia-current/418.113/build/nvidia-uvm/uvm8_perf_module_test.c
   ./tools/objtool/objtool orc generate  --module --no-fp --retpoline "/var/lib/dkms/nvidia-current/418.113/build/nvidia-uvm/.tmp_uvm8_perf_events_test.o";
   gcc-8 -Wp,-MD,/var/lib/dkms/nvidia-current/418.113/build/nvidia-uvm/.uvm8_get_rm_ptes_test.o.d  -nostdinc -isystem /usr/lib/gcc/x86_64-linux-gnu/8/include -I/usr/src/linux-headers-4.19.0-9-common/arch/x86/include -I./arch/x86/include/generated  -I/usr/src/linux-headers-4.19.0-9-common/include -I./include -I/usr/src/linux-headers-4.19.0-9-common/arch/x86/include/uapi -I./arch/x86/include/generated/uapi -I/usr/src/linux-headers-4.19.0-9-common/include/uapi -I./include/generated/uapi -include /usr/src/linux-headers-4.19.0-9-common/include/linux/kconfig.h -include /usr/src/linux-headers-4.19.0-9-common/include/linux/compiler_types.h  -I/var/lib/dkms/nvidia-current/418.113/build -I/var/lib/dkms/nvidia-current/418.113/build -D__KERNEL__ -Wall -Wundef -Wstrict-prototypes -Wno-trigraphs -fno-strict-aliasing -fno-common -fshort-wchar -Werror-implicit-function-declaration -Wno-format-security -std=gnu89 -fno-PIE -mno-sse -mno-mmx -mno-sse2 -mno-3dnow -mno-avx -m64 -falign-jumps=1 -falign-loops=1 -mno-80387 -mno-fp-ret-in-387 -mpreferred-stack-boundary=3 -mskip-rax-setup -mtune=generic -mno-red-zone -mcmodel=kernel -funit-at-a-time -DCONFIG_X86_X32_ABI -DCONFIG_AS_CFI=1 -DCONFIG_AS_CFI_SIGNAL_FRAME=1 -DCONFIG_AS_CFI_SECTIONS=1 -DCONFIG_AS_FXSAVEQ=1 -DCONFIG_AS_SSSE3=1 -DCONFIG_AS_CRC32=1 -DCONFIG_AS_AVX=1 -DCONFIG_AS_AVX2=1 -DCONFIG_AS_AVX512=1 -DCONFIG_AS_SHA1_NI=1 -DCONFIG_AS_SHA256_NI=1 -pipe -Wno-sign-compare -fno-asynchronous-unwind-tables -mindirect-branch=thunk-extern -mindirect-branch-register -fno-jump-tables -fno-delete-null-pointer-checks -Wno-frame-address -Wno-format-truncation -Wno-format-overflow -Wno-int-in-bool-context -O2 --param=allow-store-data-races=0 -Wframe-larger-than=2048 -fstack-protector-strong -Wno-unused-but-set-variable -Wno-unused-const-variable -fno-var-tracking-assignments -g -pg -mrecord-mcount -mfentry -DCC_USING_FENTRY -Wdeclaration-after-statement -Wno-pointer-sign -Wno-stringop-truncation -fno-strict-overflow -fno-merge-all-constants -fmerge-constants -fno-stack-check -fconserve-stack -Werror=implicit-int -Werror=strict-prototypes -Werror=date-time -Werror=incompatible-pointer-types -Werror=designated-init -fmacro-prefix-map=/usr/src/linux-headers-4.19.0-9-common/= -fcf-protection=none -Wno-packed-not-aligned  -I/var/lib/dkms/nvidia-current/418.113/build/common/inc  -I/var/lib/dkms/nvidia-current/418.113/build -Wall -MD -Wno-cast-qual -Wno-error -Wno-format-extra-args -D__KERNEL__ -DMODULE -DNVRM -DNV_VERSION_STRING=\"418.113\" -Wno-unused-function -Wuninitialized -fno-strict-aliasing -mno-red-zone -mcmodel=kernel -DNV_UVM_ENABLE -Werror=undef -DNV_SPECTRE_V2=0 -O2 -DNVIDIA_UVM_ENABLED -DNVIDIA_UNDEF_LEGACY_BIT_MACROS -DLinux -D__linux__  -I/var/lib/dkms/nvidia-current/418.113/build/nvidia-uvm  -DMODULE  -DKBUILD_BASENAME='"uvm8_get_rm_ptes_test"' -DKBUILD_MODNAME='"nvidia_uvm"' -c -o /var/lib/dkms/nvidia-current/418.113/build/nvidia-uvm/.tmp_uvm8_get_rm_ptes_test.o /var/lib/dkms/nvidia-current/418.113/build/nvidia-uvm/uvm8_get_rm_ptes_test.c
   ./tools/objtool/objtool orc generate  --module --no-fp --retpoline "/var/lib/dkms/nvidia-current/418.113/build/nvidia-uvm/.tmp_uvm8_perf_module_test.o";
   gcc-8 -Wp,-MD,/var/lib/dkms/nvidia-current/418.113/build/nvidia-uvm/.uvm8_fault_buffer_flush_test.o.d  -nostdinc -isystem /usr/lib/gcc/x86_64-linux-gnu/8/include -I/usr/src/linux-headers-4.19.0-9-common/arch/x86/include -I./arch/x86/include/generated  -I/usr/src/linux-headers-4.19.0-9-common/include -I./include -I/usr/src/linux-headers-4.19.0-9-common/arch/x86/include/uapi -I./arch/x86/include/generated/uapi -I/usr/src/linux-headers-4.19.0-9-common/include/uapi -I./include/generated/uapi -include /usr/src/linux-headers-4.19.0-9-common/include/linux/kconfig.h -include /usr/src/linux-headers-4.19.0-9-common/include/linux/compiler_types.h  -I/var/lib/dkms/nvidia-current/418.113/build -I/var/lib/dkms/nvidia-current/418.113/build -D__KERNEL__ -Wall -Wundef -Wstrict-prototypes -Wno-trigraphs -fno-strict-aliasing -fno-common -fshort-wchar -Werror-implicit-function-declaration -Wno-format-security -std=gnu89 -fno-PIE -mno-sse -mno-mmx -mno-sse2 -mno-3dnow -mno-avx -m64 -falign-jumps=1 -falign-loops=1 -mno-80387 -mno-fp-ret-in-387 -mpreferred-stack-boundary=3 -mskip-rax-setup -mtune=generic -mno-red-zone -mcmodel=kernel -funit-at-a-time -DCONFIG_X86_X32_ABI -DCONFIG_AS_CFI=1 -DCONFIG_AS_CFI_SIGNAL_FRAME=1 -DCONFIG_AS_CFI_SECTIONS=1 -DCONFIG_AS_FXSAVEQ=1 -DCONFIG_AS_SSSE3=1 -DCONFIG_AS_CRC32=1 -DCONFIG_AS_AVX=1 -DCONFIG_AS_AVX2=1 -DCONFIG_AS_AVX512=1 -DCONFIG_AS_SHA1_NI=1 -DCONFIG_AS_SHA256_NI=1 -pipe -Wno-sign-compare -fno-asynchronous-unwind-tables -mindirect-branch=thunk-extern -mindirect-branch-register -fno-jump-tables -fno-delete-null-pointer-checks -Wno-frame-address -Wno-format-truncation -Wno-format-overflow -Wno-int-in-bool-context -O2 --param=allow-store-data-races=0 -Wframe-larger-than=2048 -fstack-protector-strong -Wno-unused-but-set-variable -Wno-unused-const-variable -fno-var-tracking-assignments -g -pg -mrecord-mcount -mfentry -DCC_USING_FENTRY -Wdeclaration-after-statement -Wno-pointer-sign -Wno-stringop-truncation -fno-strict-overflow -fno-merge-all-constants -fmerge-constants -fno-stack-check -fconserve-stack -Werror=implicit-int -Werror=strict-prototypes -Werror=date-time -Werror=incompatible-pointer-types -Werror=designated-init -fmacro-prefix-map=/usr/src/linux-headers-4.19.0-9-common/= -fcf-protection=none -Wno-packed-not-aligned  -I/var/lib/dkms/nvidia-current/418.113/build/common/inc  -I/var/lib/dkms/nvidia-current/418.113/build -Wall -MD -Wno-cast-qual -Wno-error -Wno-format-extra-args -D__KERNEL__ -DMODULE -DNVRM -DNV_VERSION_STRING=\"418.113\" -Wno-unused-function -Wuninitialized -fno-strict-aliasing -mno-red-zone -mcmodel=kernel -DNV_UVM_ENABLE -Werror=undef -DNV_SPECTRE_V2=0 -O2 -DNVIDIA_UVM_ENABLED -DNVIDIA_UNDEF_LEGACY_BIT_MACROS -DLinux -D__linux__  -I/var/lib/dkms/nvidia-current/418.113/build/nvidia-uvm  -DMODULE  -DKBUILD_BASENAME='"uvm8_fault_buffer_flush_test"' -DKBUILD_MODNAME='"nvidia_uvm"' -c -o /var/lib/dkms/nvidia-current/418.113/build/nvidia-uvm/.tmp_uvm8_fault_buffer_flush_test.o /var/lib/dkms/nvidia-current/418.113/build/nvidia-uvm/uvm8_fault_buffer_flush_test.c
   ./tools/objtool/objtool orc generate  --module --no-fp --retpoline "/var/lib/dkms/nvidia-current/418.113/build/nvidia-uvm/.tmp_uvm8_get_rm_ptes_test.o";
   gcc-8 -Wp,-MD,/var/lib/dkms/nvidia-current/418.113/build/nvidia-uvm/.uvm8_mmu_test.o.d  -nostdinc -isystem /usr/lib/gcc/x86_64-linux-gnu/8/include -I/usr/src/linux-headers-4.19.0-9-common/arch/x86/include -I./arch/x86/include/generated  -I/usr/src/linux-headers-4.19.0-9-common/include -I./include -I/usr/src/linux-headers-4.19.0-9-common/arch/x86/include/uapi -I./arch/x86/include/generated/uapi -I/usr/src/linux-headers-4.19.0-9-common/include/uapi -I./include/generated/uapi -include /usr/src/linux-headers-4.19.0-9-common/include/linux/kconfig.h -include /usr/src/linux-headers-4.19.0-9-common/include/linux/compiler_types.h  -I/var/lib/dkms/nvidia-current/418.113/build -I/var/lib/dkms/nvidia-current/418.113/build -D__KERNEL__ -Wall -Wundef -Wstrict-prototypes -Wno-trigraphs -fno-strict-aliasing -fno-common -fshort-wchar -Werror-implicit-function-declaration -Wno-format-security -std=gnu89 -fno-PIE -mno-sse -mno-mmx -mno-sse2 -mno-3dnow -mno-avx -m64 -falign-jumps=1 -falign-loops=1 -mno-80387 -mno-fp-ret-in-387 -mpreferred-stack-boundary=3 -mskip-rax-setup -mtune=generic -mno-red-zone -mcmodel=kernel -funit-at-a-time -DCONFIG_X86_X32_ABI -DCONFIG_AS_CFI=1 -DCONFIG_AS_CFI_SIGNAL_FRAME=1 -DCONFIG_AS_CFI_SECTIONS=1 -DCONFIG_AS_FXSAVEQ=1 -DCONFIG_AS_SSSE3=1 -DCONFIG_AS_CRC32=1 -DCONFIG_AS_AVX=1 -DCONFIG_AS_AVX2=1 -DCONFIG_AS_AVX512=1 -DCONFIG_AS_SHA1_NI=1 -DCONFIG_AS_SHA256_NI=1 -pipe -Wno-sign-compare -fno-asynchronous-unwind-tables -mindirect-branch=thunk-extern -mindirect-branch-register -fno-jump-tables -fno-delete-null-pointer-checks -Wno-frame-address -Wno-format-truncation -Wno-format-overflow -Wno-int-in-bool-context -O2 --param=allow-store-data-races=0 -Wframe-larger-than=2048 -fstack-protector-strong -Wno-unused-but-set-variable -Wno-unused-const-variable -fno-var-tracking-assignments -g -pg -mrecord-mcount -mfentry -DCC_USING_FENTRY -Wdeclaration-after-statement -Wno-pointer-sign -Wno-stringop-truncation -fno-strict-overflow -fno-merge-all-constants -fmerge-constants -fno-stack-check -fconserve-stack -Werror=implicit-int -Werror=strict-prototypes -Werror=date-time -Werror=incompatible-pointer-types -Werror=designated-init -fmacro-prefix-map=/usr/src/linux-headers-4.19.0-9-common/= -fcf-protection=none -Wno-packed-not-aligned  -I/var/lib/dkms/nvidia-current/418.113/build/common/inc  -I/var/lib/dkms/nvidia-current/418.113/build -Wall -MD -Wno-cast-qual -Wno-error -Wno-format-extra-args -D__KERNEL__ -DMODULE -DNVRM -DNV_VERSION_STRING=\"418.113\" -Wno-unused-function -Wuninitialized -fno-strict-aliasing -mno-red-zone -mcmodel=kernel -DNV_UVM_ENABLE -Werror=undef -DNV_SPECTRE_V2=0 -O2 -DNVIDIA_UVM_ENABLED -DNVIDIA_UNDEF_LEGACY_BIT_MACROS -DLinux -D__linux__  -I/var/lib/dkms/nvidia-current/418.113/build/nvidia-uvm  -DMODULE  -DKBUILD_BASENAME='"uvm8_mmu_test"' -DKBUILD_MODNAME='"nvidia_uvm"' -c -o /var/lib/dkms/nvidia-current/418.113/build/nvidia-uvm/.tmp_uvm8_mmu_test.o /var/lib/dkms/nvidia-current/418.113/build/nvidia-uvm/uvm8_mmu_test.c
   ./tools/objtool/objtool orc generate  --module --no-fp --retpoline "/var/lib/dkms/nvidia-current/418.113/build/nvidia-uvm/.tmp_uvm8_fault_buffer_flush_test.o";
   gcc-8 -Wp,-MD,/var/lib/dkms/nvidia-current/418.113/build/nvidia-uvm/.uvm8_peer_identity_mappings_test.o.d  -nostdinc -isystem /usr/lib/gcc/x86_64-linux-gnu/8/include -I/usr/src/linux-headers-4.19.0-9-common/arch/x86/include -I./arch/x86/include/generated  -I/usr/src/linux-headers-4.19.0-9-common/include -I./include -I/usr/src/linux-headers-4.19.0-9-common/arch/x86/include/uapi -I./arch/x86/include/generated/uapi -I/usr/src/linux-headers-4.19.0-9-common/include/uapi -I./include/generated/uapi -include /usr/src/linux-headers-4.19.0-9-common/include/linux/kconfig.h -include /usr/src/linux-headers-4.19.0-9-common/include/linux/compiler_types.h  -I/var/lib/dkms/nvidia-current/418.113/build -I/var/lib/dkms/nvidia-current/418.113/build -D__KERNEL__ -Wall -Wundef -Wstrict-prototypes -Wno-trigraphs -fno-strict-aliasing -fno-common -fshort-wchar -Werror-implicit-function-declaration -Wno-format-security -std=gnu89 -fno-PIE -mno-sse -mno-mmx -mno-sse2 -mno-3dnow -mno-avx -m64 -falign-jumps=1 -falign-loops=1 -mno-80387 -mno-fp-ret-in-387 -mpreferred-stack-boundary=3 -mskip-rax-setup -mtune=generic -mno-red-zone -mcmodel=kernel -funit-at-a-time -DCONFIG_X86_X32_ABI -DCONFIG_AS_CFI=1 -DCONFIG_AS_CFI_SIGNAL_FRAME=1 -DCONFIG_AS_CFI_SECTIONS=1 -DCONFIG_AS_FXSAVEQ=1 -DCONFIG_AS_SSSE3=1 -DCONFIG_AS_CRC32=1 -DCONFIG_AS_AVX=1 -DCONFIG_AS_AVX2=1 -DCONFIG_AS_AVX512=1 -DCONFIG_AS_SHA1_NI=1 -DCONFIG_AS_SHA256_NI=1 -pipe -Wno-sign-compare -fno-asynchronous-unwind-tables -mindirect-branch=thunk-extern -mindirect-branch-register -fno-jump-tables -fno-delete-null-pointer-checks -Wno-frame-address -Wno-format-truncation -Wno-format-overflow -Wno-int-in-bool-context -O2 --param=allow-store-data-races=0 -Wframe-larger-than=2048 -fstack-protector-strong -Wno-unused-but-set-variable -Wno-unused-const-variable -fno-var-tracking-assignments -g -pg -mrecord-mcount -mfentry -DCC_USING_FENTRY -Wdeclaration-after-statement -Wno-pointer-sign -Wno-stringop-truncation -fno-strict-overflow -fno-merge-all-constants -fmerge-constants -fno-stack-check -fconserve-stack -Werror=implicit-int -Werror=strict-prototypes -Werror=date-time -Werror=incompatible-pointer-types -Werror=designated-init -fmacro-prefix-map=/usr/src/linux-headers-4.19.0-9-common/= -fcf-protection=none -Wno-packed-not-aligned  -I/var/lib/dkms/nvidia-current/418.113/build/common/inc  -I/var/lib/dkms/nvidia-current/418.113/build -Wall -MD -Wno-cast-qual -Wno-error -Wno-format-extra-args -D__KERNEL__ -DMODULE -DNVRM -DNV_VERSION_STRING=\"418.113\" -Wno-unused-function -Wuninitialized -fno-strict-aliasing -mno-red-zone -mcmodel=kernel -DNV_UVM_ENABLE -Werror=undef -DNV_SPECTRE_V2=0 -O2 -DNVIDIA_UVM_ENABLED -DNVIDIA_UNDEF_LEGACY_BIT_MACROS -DLinux -D__linux__  -I/var/lib/dkms/nvidia-current/418.113/build/nvidia-uvm  -DMODULE  -DKBUILD_BASENAME='"uvm8_peer_identity_mappings_test"' -DKBUILD_MODNAME='"nvidia_uvm"' -c -o /var/lib/dkms/nvidia-current/418.113/build/nvidia-uvm/.tmp_uvm8_peer_identity_mappings_test.o /var/lib/dkms/nvidia-current/418.113/build/nvidia-uvm/uvm8_peer_identity_mappings_test.c
   ./tools/objtool/objtool orc generate  --module --no-fp --retpoline "/var/lib/dkms/nvidia-current/418.113/build/nvidia-uvm/.tmp_uvm8_mmu_test.o";
   gcc-8 -Wp,-MD,/var/lib/dkms/nvidia-current/418.113/build/nvidia-uvm/.uvm8_va_block_test.o.d  -nostdinc -isystem /usr/lib/gcc/x86_64-linux-gnu/8/include -I/usr/src/linux-headers-4.19.0-9-common/arch/x86/include -I./arch/x86/include/generated  -I/usr/src/linux-headers-4.19.0-9-common/include -I./include -I/usr/src/linux-headers-4.19.0-9-common/arch/x86/include/uapi -I./arch/x86/include/generated/uapi -I/usr/src/linux-headers-4.19.0-9-common/include/uapi -I./include/generated/uapi -include /usr/src/linux-headers-4.19.0-9-common/include/linux/kconfig.h -include /usr/src/linux-headers-4.19.0-9-common/include/linux/compiler_types.h  -I/var/lib/dkms/nvidia-current/418.113/build -I/var/lib/dkms/nvidia-current/418.113/build -D__KERNEL__ -Wall -Wundef -Wstrict-prototypes -Wno-trigraphs -fno-strict-aliasing -fno-common -fshort-wchar -Werror-implicit-function-declaration -Wno-format-security -std=gnu89 -fno-PIE -mno-sse -mno-mmx -mno-sse2 -mno-3dnow -mno-avx -m64 -falign-jumps=1 -falign-loops=1 -mno-80387 -mno-fp-ret-in-387 -mpreferred-stack-boundary=3 -mskip-rax-setup -mtune=generic -mno-red-zone -mcmodel=kernel -funit-at-a-time -DCONFIG_X86_X32_ABI -DCONFIG_AS_CFI=1 -DCONFIG_AS_CFI_SIGNAL_FRAME=1 -DCONFIG_AS_CFI_SECTIONS=1 -DCONFIG_AS_FXSAVEQ=1 -DCONFIG_AS_SSSE3=1 -DCONFIG_AS_CRC32=1 -DCONFIG_AS_AVX=1 -DCONFIG_AS_AVX2=1 -DCONFIG_AS_AVX512=1 -DCONFIG_AS_SHA1_NI=1 -DCONFIG_AS_SHA256_NI=1 -pipe -Wno-sign-compare -fno-asynchronous-unwind-tables -mindirect-branch=thunk-extern -mindirect-branch-register -fno-jump-tables -fno-delete-null-pointer-checks -Wno-frame-address -Wno-format-truncation -Wno-format-overflow -Wno-int-in-bool-context -O2 --param=allow-store-data-races=0 -Wframe-larger-than=2048 -fstack-protector-strong -Wno-unused-but-set-variable -Wno-unused-const-variable -fno-var-tracking-assignments -g -pg -mrecord-mcount -mfentry -DCC_USING_FENTRY -Wdeclaration-after-statement -Wno-pointer-sign -Wno-stringop-truncation -fno-strict-overflow -fno-merge-all-constants -fmerge-constants -fno-stack-check -fconserve-stack -Werror=implicit-int -Werror=strict-prototypes -Werror=date-time -Werror=incompatible-pointer-types -Werror=designated-init -fmacro-prefix-map=/usr/src/linux-headers-4.19.0-9-common/= -fcf-protection=none -Wno-packed-not-aligned  -I/var/lib/dkms/nvidia-current/418.113/build/common/inc  -I/var/lib/dkms/nvidia-current/418.113/build -Wall -MD -Wno-cast-qual -Wno-error -Wno-format-extra-args -D__KERNEL__ -DMODULE -DNVRM -DNV_VERSION_STRING=\"418.113\" -Wno-unused-function -Wuninitialized -fno-strict-aliasing -mno-red-zone -mcmodel=kernel -DNV_UVM_ENABLE -Werror=undef -DNV_SPECTRE_V2=0 -O2 -DNVIDIA_UVM_ENABLED -DNVIDIA_UNDEF_LEGACY_BIT_MACROS -DLinux -D__linux__  -I/var/lib/dkms/nvidia-current/418.113/build/nvidia-uvm  -DMODULE  -DKBUILD_BASENAME='"uvm8_va_block_test"' -DKBUILD_MODNAME='"nvidia_uvm"' -c -o /var/lib/dkms/nvidia-current/418.113/build/nvidia-uvm/.tmp_uvm8_va_block_test.o /var/lib/dkms/nvidia-current/418.113/build/nvidia-uvm/uvm8_va_block_test.c
   ./tools/objtool/objtool orc generate  --module --no-fp --retpoline "/var/lib/dkms/nvidia-current/418.113/build/nvidia-uvm/.tmp_uvm8_peer_identity_mappings_test.o";
   gcc-8 -Wp,-MD,/var/lib/dkms/nvidia-current/418.113/build/nvidia-uvm/.uvm8_range_group_tree_test.o.d  -nostdinc -isystem /usr/lib/gcc/x86_64-linux-gnu/8/include -I/usr/src/linux-headers-4.19.0-9-common/arch/x86/include -I./arch/x86/include/generated  -I/usr/src/linux-headers-4.19.0-9-common/include -I./include -I/usr/src/linux-headers-4.19.0-9-common/arch/x86/include/uapi -I./arch/x86/include/generated/uapi -I/usr/src/linux-headers-4.19.0-9-common/include/uapi -I./include/generated/uapi -include /usr/src/linux-headers-4.19.0-9-common/include/linux/kconfig.h -include /usr/src/linux-headers-4.19.0-9-common/include/linux/compiler_types.h  -I/var/lib/dkms/nvidia-current/418.113/build -I/var/lib/dkms/nvidia-current/418.113/build -D__KERNEL__ -Wall -Wundef -Wstrict-prototypes -Wno-trigraphs -fno-strict-aliasing -fno-common -fshort-wchar -Werror-implicit-function-declaration -Wno-format-security -std=gnu89 -fno-PIE -mno-sse -mno-mmx -mno-sse2 -mno-3dnow -mno-avx -m64 -falign-jumps=1 -falign-loops=1 -mno-80387 -mno-fp-ret-in-387 -mpreferred-stack-boundary=3 -mskip-rax-setup -mtune=generic -mno-red-zone -mcmodel=kernel -funit-at-a-time -DCONFIG_X86_X32_ABI -DCONFIG_AS_CFI=1 -DCONFIG_AS_CFI_SIGNAL_FRAME=1 -DCONFIG_AS_CFI_SECTIONS=1 -DCONFIG_AS_FXSAVEQ=1 -DCONFIG_AS_SSSE3=1 -DCONFIG_AS_CRC32=1 -DCONFIG_AS_AVX=1 -DCONFIG_AS_AVX2=1 -DCONFIG_AS_AVX512=1 -DCONFIG_AS_SHA1_NI=1 -DCONFIG_AS_SHA256_NI=1 -pipe -Wno-sign-compare -fno-asynchronous-unwind-tables -mindirect-branch=thunk-extern -mindirect-branch-register -fno-jump-tables -fno-delete-null-pointer-checks -Wno-frame-address -Wno-format-truncation -Wno-format-overflow -Wno-int-in-bool-context -O2 --param=allow-store-data-races=0 -Wframe-larger-than=2048 -fstack-protector-strong -Wno-unused-but-set-variable -Wno-unused-const-variable -fno-var-tracking-assignments -g -pg -mrecord-mcount -mfentry -DCC_USING_FENTRY -Wdeclaration-after-statement -Wno-pointer-sign -Wno-stringop-truncation -fno-strict-overflow -fno-merge-all-constants -fmerge-constants -fno-stack-check -fconserve-stack -Werror=implicit-int -Werror=strict-prototypes -Werror=date-time -Werror=incompatible-pointer-types -Werror=designated-init -fmacro-prefix-map=/usr/src/linux-headers-4.19.0-9-common/= -fcf-protection=none -Wno-packed-not-aligned  -I/var/lib/dkms/nvidia-current/418.113/build/common/inc  -I/var/lib/dkms/nvidia-current/418.113/build -Wall -MD -Wno-cast-qual -Wno-error -Wno-format-extra-args -D__KERNEL__ -DMODULE -DNVRM -DNV_VERSION_STRING=\"418.113\" -Wno-unused-function -Wuninitialized -fno-strict-aliasing -mno-red-zone -mcmodel=kernel -DNV_UVM_ENABLE -Werror=undef -DNV_SPECTRE_V2=0 -O2 -DNVIDIA_UVM_ENABLED -DNVIDIA_UNDEF_LEGACY_BIT_MACROS -DLinux -D__linux__  -I/var/lib/dkms/nvidia-current/418.113/build/nvidia-uvm  -DMODULE  -DKBUILD_BASENAME='"uvm8_range_group_tree_test"' -DKBUILD_MODNAME='"nvidia_uvm"' -c -o /var/lib/dkms/nvidia-current/418.113/build/nvidia-uvm/.tmp_uvm8_range_group_tree_test.o /var/lib/dkms/nvidia-current/418.113/build/nvidia-uvm/uvm8_range_group_tree_test.c
   ./tools/objtool/objtool orc generate  --module --no-fp --retpoline "/var/lib/dkms/nvidia-current/418.113/build/nvidia-uvm/.tmp_uvm8_va_block_test.o";
   gcc-8 -Wp,-MD,/var/lib/dkms/nvidia-current/418.113/build/nvidia-modeset/.nvidia-modeset-linux.o.d  -nostdinc -isystem /usr/lib/gcc/x86_64-linux-gnu/8/include -I/usr/src/linux-headers-4.19.0-9-common/arch/x86/include -I./arch/x86/include/generated  -I/usr/src/linux-headers-4.19.0-9-common/include -I./include -I/usr/src/linux-headers-4.19.0-9-common/arch/x86/include/uapi -I./arch/x86/include/generated/uapi -I/usr/src/linux-headers-4.19.0-9-common/include/uapi -I./include/generated/uapi -include /usr/src/linux-headers-4.19.0-9-common/include/linux/kconfig.h -include /usr/src/linux-headers-4.19.0-9-common/include/linux/compiler_types.h  -I/var/lib/dkms/nvidia-current/418.113/build -I/var/lib/dkms/nvidia-current/418.113/build -D__KERNEL__ -Wall -Wundef -Wstrict-prototypes -Wno-trigraphs -fno-strict-aliasing -fno-common -fshort-wchar -Werror-implicit-function-declaration -Wno-format-security -std=gnu89 -fno-PIE -mno-sse -mno-mmx -mno-sse2 -mno-3dnow -mno-avx -m64 -falign-jumps=1 -falign-loops=1 -mno-80387 -mno-fp-ret-in-387 -mpreferred-stack-boundary=3 -mskip-rax-setup -mtune=generic -mno-red-zone -mcmodel=kernel -funit-at-a-time -DCONFIG_X86_X32_ABI -DCONFIG_AS_CFI=1 -DCONFIG_AS_CFI_SIGNAL_FRAME=1 -DCONFIG_AS_CFI_SECTIONS=1 -DCONFIG_AS_FXSAVEQ=1 -DCONFIG_AS_SSSE3=1 -DCONFIG_AS_CRC32=1 -DCONFIG_AS_AVX=1 -DCONFIG_AS_AVX2=1 -DCONFIG_AS_AVX512=1 -DCONFIG_AS_SHA1_NI=1 -DCONFIG_AS_SHA256_NI=1 -pipe -Wno-sign-compare -fno-asynchronous-unwind-tables -mindirect-branch=thunk-extern -mindirect-branch-register -fno-jump-tables -fno-delete-null-pointer-checks -Wno-frame-address -Wno-format-truncation -Wno-format-overflow -Wno-int-in-bool-context -O2 --param=allow-store-data-races=0 -Wframe-larger-than=2048 -fstack-protector-strong -Wno-unused-but-set-variable -Wno-unused-const-variable -fno-var-tracking-assignments -g -pg -mrecord-mcount -mfentry -DCC_USING_FENTRY -Wdeclaration-after-statement -Wno-pointer-sign -Wno-stringop-truncation -fno-strict-overflow -fno-merge-all-constants -fmerge-constants -fno-stack-check -fconserve-stack -Werror=implicit-int -Werror=strict-prototypes -Werror=date-time -Werror=incompatible-pointer-types -Werror=designated-init -fmacro-prefix-map=/usr/src/linux-headers-4.19.0-9-common/= -fcf-protection=none -Wno-packed-not-aligned  -I/var/lib/dkms/nvidia-current/418.113/build/common/inc  -I/var/lib/dkms/nvidia-current/418.113/build -Wall -MD -Wno-cast-qual -Wno-error -Wno-format-extra-args -D__KERNEL__ -DMODULE -DNVRM -DNV_VERSION_STRING=\"418.113\" -Wno-unused-function -Wuninitialized -fno-strict-aliasing -mno-red-zone -mcmodel=kernel -DNV_UVM_ENABLE -Werror=undef -DNV_SPECTRE_V2=0  -I/var/lib/dkms/nvidia-current/418.113/build/nvidia-modeset -UDEBUG -U_DEBUG -DNDEBUG -DNV_BUILD_MODULE_INSTANCES=0  -DMODULE  -DKBUILD_BASENAME='"nvidia_modeset_linux"' -DKBUILD_MODNAME='"nvidia_modeset"' -c -o /var/lib/dkms/nvidia-current/418.113/build/nvidia-modeset/.tmp_nvidia-modeset-linux.o /var/lib/dkms/nvidia-current/418.113/build/nvidia-modeset/nvidia-modeset-linux.c
   ./tools/objtool/objtool orc generate  --module --no-fp --retpoline "/var/lib/dkms/nvidia-current/418.113/build/nvidia-modeset/.tmp_nvidia-modeset-linux.o";
   gcc-8 -Wp,-MD,/var/lib/dkms/nvidia-current/418.113/build/nvidia-drm/.nvidia-drm.o.d  -nostdinc -isystem /usr/lib/gcc/x86_64-linux-gnu/8/include -I/usr/src/linux-headers-4.19.0-9-common/arch/x86/include -I./arch/x86/include/generated  -I/usr/src/linux-headers-4.19.0-9-common/include -I./include -I/usr/src/linux-headers-4.19.0-9-common/arch/x86/include/uapi -I./arch/x86/include/generated/uapi -I/usr/src/linux-headers-4.19.0-9-common/include/uapi -I./include/generated/uapi -include /usr/src/linux-headers-4.19.0-9-common/include/linux/kconfig.h -include /usr/src/linux-headers-4.19.0-9-common/include/linux/compiler_types.h  -I/var/lib/dkms/nvidia-current/418.113/build -I/var/lib/dkms/nvidia-current/418.113/build -D__KERNEL__ -Wall -Wundef -Wstrict-prototypes -Wno-trigraphs -fno-strict-aliasing -fno-common -fshort-wchar -Werror-implicit-function-declaration -Wno-format-security -std=gnu89 -fno-PIE -mno-sse -mno-mmx -mno-sse2 -mno-3dnow -mno-avx -m64 -falign-jumps=1 -falign-loops=1 -mno-80387 -mno-fp-ret-in-387 -mpreferred-stack-boundary=3 -mskip-rax-setup -mtune=generic -mno-red-zone -mcmodel=kernel -funit-at-a-time -DCONFIG_X86_X32_ABI -DCONFIG_AS_CFI=1 -DCONFIG_AS_CFI_SIGNAL_FRAME=1 -DCONFIG_AS_CFI_SECTIONS=1 -DCONFIG_AS_FXSAVEQ=1 -DCONFIG_AS_SSSE3=1 -DCONFIG_AS_CRC32=1 -DCONFIG_AS_AVX=1 -DCONFIG_AS_AVX2=1 -DCONFIG_AS_AVX512=1 -DCONFIG_AS_SHA1_NI=1 -DCONFIG_AS_SHA256_NI=1 -pipe -Wno-sign-compare -fno-asynchronous-unwind-tables -mindirect-branch=thunk-extern -mindirect-branch-register -fno-jump-tables -fno-delete-null-pointer-checks -Wno-frame-address -Wno-format-truncation -Wno-format-overflow -Wno-int-in-bool-context -O2 --param=allow-store-data-races=0 -Wframe-larger-than=2048 -fstack-protector-strong -Wno-unused-but-set-variable -Wno-unused-const-variable -fno-var-tracking-assignments -g -pg -mrecord-mcount -mfentry -DCC_USING_FENTRY -Wdeclaration-after-statement -Wno-pointer-sign -Wno-stringop-truncation -fno-strict-overflow -fno-merge-all-constants -fmerge-constants -fno-stack-check -fconserve-stack -Werror=implicit-int -Werror=strict-prototypes -Werror=date-time -Werror=incompatible-pointer-types -Werror=designated-init -fmacro-prefix-map=/usr/src/linux-headers-4.19.0-9-common/= -fcf-protection=none -Wno-packed-not-aligned  -I/var/lib/dkms/nvidia-current/418.113/build/common/inc  -I/var/lib/dkms/nvidia-current/418.113/build -Wall -MD -Wno-cast-qual -Wno-error -Wno-format-extra-args -D__KERNEL__ -DMODULE -DNVRM -DNV_VERSION_STRING=\"418.113\" -Wno-unused-function -Wuninitialized -fno-strict-aliasing -mno-red-zone -mcmodel=kernel -DNV_UVM_ENABLE -Werror=undef -DNV_SPECTRE_V2=0  -I/var/lib/dkms/nvidia-current/418.113/build/nvidia-drm -UDEBUG -U_DEBUG -DNDEBUG -DNV_BUILD_MODULE_INSTANCES=0  -DMODULE  -DKBUILD_BASENAME='"nvidia_drm"' -DKBUILD_MODNAME='"nvidia_drm"' -c -o /var/lib/dkms/nvidia-current/418.113/build/nvidia-drm/.tmp_nvidia-drm.o /var/lib/dkms/nvidia-current/418.113/build/nvidia-drm/nvidia-drm.c
   ./tools/objtool/objtool orc generate  --module --no-fp --retpoline "/var/lib/dkms/nvidia-current/418.113/build/nvidia-uvm/.tmp_uvm8_range_group_tree_test.o";
   gcc-8 -Wp,-MD,/var/lib/dkms/nvidia-current/418.113/build/nvidia-drm/.nvidia-drm-drv.o.d  -nostdinc -isystem /usr/lib/gcc/x86_64-linux-gnu/8/include -I/usr/src/linux-headers-4.19.0-9-common/arch/x86/include -I./arch/x86/include/generated  -I/usr/src/linux-headers-4.19.0-9-common/include -I./include -I/usr/src/linux-headers-4.19.0-9-common/arch/x86/include/uapi -I./arch/x86/include/generated/uapi -I/usr/src/linux-headers-4.19.0-9-common/include/uapi -I./include/generated/uapi -include /usr/src/linux-headers-4.19.0-9-common/include/linux/kconfig.h -include /usr/src/linux-headers-4.19.0-9-common/include/linux/compiler_types.h  -I/var/lib/dkms/nvidia-current/418.113/build -I/var/lib/dkms/nvidia-current/418.113/build -D__KERNEL__ -Wall -Wundef -Wstrict-prototypes -Wno-trigraphs -fno-strict-aliasing -fno-common -fshort-wchar -Werror-implicit-function-declaration -Wno-format-security -std=gnu89 -fno-PIE -mno-sse -mno-mmx -mno-sse2 -mno-3dnow -mno-avx -m64 -falign-jumps=1 -falign-loops=1 -mno-80387 -mno-fp-ret-in-387 -mpreferred-stack-boundary=3 -mskip-rax-setup -mtune=generic -mno-red-zone -mcmodel=kernel -funit-at-a-time -DCONFIG_X86_X32_ABI -DCONFIG_AS_CFI=1 -DCONFIG_AS_CFI_SIGNAL_FRAME=1 -DCONFIG_AS_CFI_SECTIONS=1 -DCONFIG_AS_FXSAVEQ=1 -DCONFIG_AS_SSSE3=1 -DCONFIG_AS_CRC32=1 -DCONFIG_AS_AVX=1 -DCONFIG_AS_AVX2=1 -DCONFIG_AS_AVX512=1 -DCONFIG_AS_SHA1_NI=1 -DCONFIG_AS_SHA256_NI=1 -pipe -Wno-sign-compare -fno-asynchronous-unwind-tables -mindirect-branch=thunk-extern -mindirect-branch-register -fno-jump-tables -fno-delete-null-pointer-checks -Wno-frame-address -Wno-format-truncation -Wno-format-overflow -Wno-int-in-bool-context -O2 --param=allow-store-data-races=0 -Wframe-larger-than=2048 -fstack-protector-strong -Wno-unused-but-set-variable -Wno-unused-const-variable -fno-var-tracking-assignments -g -pg -mrecord-mcount -mfentry -DCC_USING_FENTRY -Wdeclaration-after-statement -Wno-pointer-sign -Wno-stringop-truncation -fno-strict-overflow -fno-merge-all-constants -fmerge-constants -fno-stack-check -fconserve-stack -Werror=implicit-int -Werror=strict-prototypes -Werror=date-time -Werror=incompatible-pointer-types -Werror=designated-init -fmacro-prefix-map=/usr/src/linux-headers-4.19.0-9-common/= -fcf-protection=none -Wno-packed-not-aligned  -I/var/lib/dkms/nvidia-current/418.113/build/common/inc  -I/var/lib/dkms/nvidia-current/418.113/build -Wall -MD -Wno-cast-qual -Wno-error -Wno-format-extra-args -D__KERNEL__ -DMODULE -DNVRM -DNV_VERSION_STRING=\"418.113\" -Wno-unused-function -Wuninitialized -fno-strict-aliasing -mno-red-zone -mcmodel=kernel -DNV_UVM_ENABLE -Werror=undef -DNV_SPECTRE_V2=0  -I/var/lib/dkms/nvidia-current/418.113/build/nvidia-drm -UDEBUG -U_DEBUG -DNDEBUG -DNV_BUILD_MODULE_INSTANCES=0  -DMODULE  -DKBUILD_BASENAME='"nvidia_drm_drv"' -DKBUILD_MODNAME='"nvidia_drm"' -c -o /var/lib/dkms/nvidia-current/418.113/build/nvidia-drm/.tmp_nvidia-drm-drv.o /var/lib/dkms/nvidia-current/418.113/build/nvidia-drm/nvidia-drm-drv.c
   ./tools/objtool/objtool orc generate  --module --no-fp --retpoline "/var/lib/dkms/nvidia-current/418.113/build/nvidia-drm/.tmp_nvidia-drm.o";
   gcc-8 -Wp,-MD,/var/lib/dkms/nvidia-current/418.113/build/nvidia-drm/.nvidia-drm-utils.o.d  -nostdinc -isystem /usr/lib/gcc/x86_64-linux-gnu/8/include -I/usr/src/linux-headers-4.19.0-9-common/arch/x86/include -I./arch/x86/include/generated  -I/usr/src/linux-headers-4.19.0-9-common/include -I./include -I/usr/src/linux-headers-4.19.0-9-common/arch/x86/include/uapi -I./arch/x86/include/generated/uapi -I/usr/src/linux-headers-4.19.0-9-common/include/uapi -I./include/generated/uapi -include /usr/src/linux-headers-4.19.0-9-common/include/linux/kconfig.h -include /usr/src/linux-headers-4.19.0-9-common/include/linux/compiler_types.h  -I/var/lib/dkms/nvidia-current/418.113/build -I/var/lib/dkms/nvidia-current/418.113/build -D__KERNEL__ -Wall -Wundef -Wstrict-prototypes -Wno-trigraphs -fno-strict-aliasing -fno-common -fshort-wchar -Werror-implicit-function-declaration -Wno-format-security -std=gnu89 -fno-PIE -mno-sse -mno-mmx -mno-sse2 -mno-3dnow -mno-avx -m64 -falign-jumps=1 -falign-loops=1 -mno-80387 -mno-fp-ret-in-387 -mpreferred-stack-boundary=3 -mskip-rax-setup -mtune=generic -mno-red-zone -mcmodel=kernel -funit-at-a-time -DCONFIG_X86_X32_ABI -DCONFIG_AS_CFI=1 -DCONFIG_AS_CFI_SIGNAL_FRAME=1 -DCONFIG_AS_CFI_SECTIONS=1 -DCONFIG_AS_FXSAVEQ=1 -DCONFIG_AS_SSSE3=1 -DCONFIG_AS_CRC32=1 -DCONFIG_AS_AVX=1 -DCONFIG_AS_AVX2=1 -DCONFIG_AS_AVX512=1 -DCONFIG_AS_SHA1_NI=1 -DCONFIG_AS_SHA256_NI=1 -pipe -Wno-sign-compare -fno-asynchronous-unwind-tables -mindirect-branch=thunk-extern -mindirect-branch-register -fno-jump-tables -fno-delete-null-pointer-checks -Wno-frame-address -Wno-format-truncation -Wno-format-overflow -Wno-int-in-bool-context -O2 --param=allow-store-data-races=0 -Wframe-larger-than=2048 -fstack-protector-strong -Wno-unused-but-set-variable -Wno-unused-const-variable -fno-var-tracking-assignments -g -pg -mrecord-mcount -mfentry -DCC_USING_FENTRY -Wdeclaration-after-statement -Wno-pointer-sign -Wno-stringop-truncation -fno-strict-overflow -fno-merge-all-constants -fmerge-constants -fno-stack-check -fconserve-stack -Werror=implicit-int -Werror=strict-prototypes -Werror=date-time -Werror=incompatible-pointer-types -Werror=designated-init -fmacro-prefix-map=/usr/src/linux-headers-4.19.0-9-common/= -fcf-protection=none -Wno-packed-not-aligned  -I/var/lib/dkms/nvidia-current/418.113/build/common/inc  -I/var/lib/dkms/nvidia-current/418.113/build -Wall -MD -Wno-cast-qual -Wno-error -Wno-format-extra-args -D__KERNEL__ -DMODULE -DNVRM -DNV_VERSION_STRING=\"418.113\" -Wno-unused-function -Wuninitialized -fno-strict-aliasing -mno-red-zone -mcmodel=kernel -DNV_UVM_ENABLE -Werror=undef -DNV_SPECTRE_V2=0  -I/var/lib/dkms/nvidia-current/418.113/build/nvidia-drm -UDEBUG -U_DEBUG -DNDEBUG -DNV_BUILD_MODULE_INSTANCES=0  -DMODULE  -DKBUILD_BASENAME='"nvidia_drm_utils"' -DKBUILD_MODNAME='"nvidia_drm"' -c -o /var/lib/dkms/nvidia-current/418.113/build/nvidia-drm/.tmp_nvidia-drm-utils.o /var/lib/dkms/nvidia-current/418.113/build/nvidia-drm/nvidia-drm-utils.c
In file included from /var/lib/dkms/nvidia-current/418.113/build/nvidia-drm/nvidia-drm-crtc.h:30,
                 from /var/lib/dkms/nvidia-current/418.113/build/nvidia-drm/nvidia-drm-drv.c:32:
/var/lib/dkms/nvidia-current/418.113/build/nvidia-drm/nvidia-drm-helper.h: In function ‘nv_drm_connector_attach_encoder’:
/var/lib/dkms/nvidia-current/418.113/build/nvidia-drm/nvidia-drm-helper.h:284:12: error: implicit declaration of function ‘drm_mode_connector_attach_encoder’; did you mean ‘drm_connector_attach_encoder’? [-Werror=implicit-function-declaration]
     return drm_mode_connector_attach_encoder(connector, encoder);
            ^~~~~~~~~~~~~~~~~~~~~~~~~~~~~~~~~
            drm_connector_attach_encoder
/var/lib/dkms/nvidia-current/418.113/build/nvidia-drm/nvidia-drm-helper.h: In function ‘nv_drm_connector_update_edid_property’:
/var/lib/dkms/nvidia-current/418.113/build/nvidia-drm/nvidia-drm-helper.h:295:12: error: implicit declaration of function ‘drm_mode_connector_update_edid_property’; did you mean ‘drm_connector_update_edid_property’? [-Werror=implicit-function-declaration]
     return drm_mode_connector_update_edid_property(connector, edid);
            ^~~~~~~~~~~~~~~~~~~~~~~~~~~~~~~~~~~~~~~
            drm_connector_update_edid_property
cc1: some warnings being treated as errors
make[3]: *** [/usr/src/linux-headers-4.19.0-9-common/scripts/Makefile.build:308: /var/lib/dkms/nvidia-current/418.113/build/nvidia-drm/nvidia-drm-drv.o] Error 1
make[3]: *** Attente des tâches non terminées....
   ./tools/objtool/objtool orc generate  --module --no-fp --retpoline "/var/lib/dkms/nvidia-current/418.113/build/nvidia-drm/.tmp_nvidia-drm-utils.o";
make[2]: *** [/usr/src/linux-headers-4.19.0-9-common/Makefile:1537: _module_/var/lib/dkms/nvidia-current/418.113/build] Error 2
make[2] : on quitte le répertoire « /usr/src/linux-headers-4.19.0-9-amd64 »
make[1]: *** [Makefile:146: sub-make] Error 2
make[1] : on quitte le répertoire « /usr/src/linux-headers-4.19.0-9-common »
make: *** [Makefile:81: modules] Error 2
alain@mpat-pc:~$
 




Voila, j'espère n'avoir rien oublié wink
Il ne me reste plus qu'a purger nvidia et redémarre sur nouveau sad

PS: J'ai bien un avis, mais pas sur de moi du tout. Alors voila comme j'ai installé il n' y a pas très longtemps ce même pilote sur une debian 10.3 avec le noyau 4.19.0-8-amd64, je me dis que ça doit être un problème de noyau. Non? le 4.19.0-9-amd64 buguerait peut être avec le pilote nvidia?
Pour info sur la debian 10.3 dont je parle: /!\ ATTENTION, qu'on soit bien d'accord le retour de inxi -SG ci-dessous concerne une autre machine qui fonctionne parfaitement

alain@debian:~$ inxi -SG
System:    Host: debian Kernel: 4.19.0-8-amd64 x86_64 bits: 64 Desktop: KDE Plasma 5.14.5
           Distro: Debian GNU/Linux 10 (buster)
Graphics:  Device-1: NVIDIA GM204 [GeForce GTX 970] driver: nvidia v: 418.74
           Display: x11 server: X.Org 1.20.4 driver: nvidia tty: N/A
           OpenGL: renderer: GeForce GTX 970/PCIe/SSE2 v: 4.6.0 NVIDIA 418.74
alain@debian:~$
 



Bonne journée à vous smile

Dernière modification par alain65 (22-05-2020 06:08:17)


In a world without walls and fences, who needs windows and gates?
A computer is like air conditioning - it becomes useless when you open Windows (L.T)
file-R82e72401f1fc045b22e79ab7e9ca81e8
Quelques une de mes machines

Hors ligne

#16 22-05-2020 07:50:46

Croutons
Membre
Distrib. : Handylinux 2.5 vers Jessie et Debian Stretch
Noyau : Linux 3.16.0-4-686-pae, Linux 4.9.0-7-686-pae
(G)UI : xfce
Inscription : 16-12-2016

Re : Impossible d'installer nvidia-driver sur debian 10.4 kernel 4.19.0-9

Hello
j'ai se genre de soucis avec Libre Office ou je m'en sortais pas avec une histoire de dépendance, même après une purge l'installation ne voulait rien savoir
donc tente

apt --fix-broken install


dpkg --configure -a


apt-get upgrade -f


apt update &&  apt upgrade


-->les cahiers du debutant<--      WikiDF-->Découvrir les principales commandes Linux<--
L' expérience, c'est le nom que chacun donne à ses erreurs. Oscar Wilde

Hors ligne

#17 23-05-2020 03:54:34

alain65
Membre
Lieu : chelles
Distrib. : Debian GNU/Linux 10
Noyau : Linux 4.19.0-6-amd64 (x86_64)
(G)UI : KDE (kwin)
Inscription : 26-07-2016

Re : Impossible d'installer nvidia-driver sur debian 10.4 kernel 4.19.0-9

Hello Croutons smile

Merci pour tes propositions effectivement je n'avais pas fait de "apt --fix-broken install". Debian étant si stable et solide que j'en ai rarement l'occasion.
Effectivement dans le déroulement de l'installation il y a bien :

dpkg: des problèmes de dépendances empêchent la configuration de nvidia-driver



Je ferai donc ce que tu propose, mais malheureusement pas avant la nuit de lundi, car présentement je suis au boulot et ne fini que lundi. Et donc je n'ai pas le PC sous la main (c'est une tour).

Bon WE smile


In a world without walls and fences, who needs windows and gates?
A computer is like air conditioning - it becomes useless when you open Windows (L.T)
file-R82e72401f1fc045b22e79ab7e9ca81e8
Quelques une de mes machines

Hors ligne

#18 26-05-2020 01:34:23

alain65
Membre
Lieu : chelles
Distrib. : Debian GNU/Linux 10
Noyau : Linux 4.19.0-6-amd64 (x86_64)
(G)UI : KDE (kwin)
Inscription : 26-07-2016

Re : Impossible d'installer nvidia-driver sur debian 10.4 kernel 4.19.0-9

Bonjour à tous smile

De retour mais seulement pour cette nuit et la prochaine... sad

@Croutons:

J'ai donc une nouvelle fois refait la procédure d'installation (je ne compte plus roll ).
Avant de commencer j'ai vidé le cache d'apt, puis update, puis fais les mises à jour.
Comme d'habitude elle c'est terminée avec les mêmes erreurs (au moins c'est constant wink )
J'ai donc appliqué tes propositions:

apt --fix-broken install


Lecture des listes de paquets... Fait
Construction de l'arbre des dépendances      
Lecture des informations d'état... Fait
0 mis à jour, 0 nouvellement installés, 0 à enlever et 0 non mis à jour.
2 partiellement installés ou enlevés.
Après cette opération, 0 o d'espace disque supplémentaires seront utilisés.
Paramétrage de nvidia-kernel-dkms (418.113-1) ...
Removing old nvidia-current-418.113 DKMS files...

------------------------------
Deleting module version: 418.113
completely from the DKMS tree.
------------------------------
Done.
Loading new nvidia-current-418.113 DKMS files...
Building for 4.19.0-9-amd64
Building initial module for 4.19.0-9-amd64
Error! Bad return status for module build on kernel: 4.19.0-9-amd64 (x86_64)
Consult /var/lib/dkms/nvidia-current/418.113/build/make.log for more information.
dpkg: erreur de traitement du paquet nvidia-kernel-dkms (--configure) :
 installed nvidia-kernel-dkms package post-installation script subprocess returned error exit status 10
dpkg: des problèmes de dépendances empêchent la configuration de nvidia-driver :
 nvidia-driver dépend de nvidia-kernel-dkms (= 418.113-1) | nvidia-kernel-418.113 ; cependant :
 Le paquet nvidia-kernel-dkms n'est pas encore configuré.
  Le paquet nvidia-kernel-418.113 n'est pas installé.
  Le paquet nvidia-kernel-dkms qui fournit nvidia-kernel-418.113 n'est pas encore configuré.

dpkg: erreur de traitement du paquet nvidia-driver (--configure) :
 problèmes de dépendances - laissé non configuré
Des erreurs ont été rencontrées pendant l'exécution :
 nvidia-kernel-dkms
 nvidia-driver
E: Sub-process /usr/bin/dpkg returned an error code (1)
 


Ça commence mal. hmm

Malgré tout je fais les suivantes:

dpkg --configure -a


Paramétrage de nvidia-kernel-dkms (418.113-1) ...
Removing old nvidia-current-418.113 DKMS files...

------------------------------
Deleting module version: 418.113
completely from the DKMS tree.
------------------------------
Done.
Loading new nvidia-current-418.113 DKMS files...
Building for 4.19.0-9-amd64
Building initial module for 4.19.0-9-amd64
Error! Bad return status for module build on kernel: 4.19.0-9-amd64 (x86_64)
Consult /var/lib/dkms/nvidia-current/418.113/build/make.log for more information.
dpkg: erreur de traitement du paquet nvidia-kernel-dkms (--configure) :
 installed nvidia-kernel-dkms package post-installation script subprocess returned error exit status 10
dpkg: des problèmes de dépendances empêchent la configuration de nvidia-driver :
 nvidia-driver dépend de nvidia-kernel-dkms (= 418.113-1) | nvidia-kernel-418.113 ; cependant :
 Le paquet nvidia-kernel-dkms n'est pas encore configuré.
  Le paquet nvidia-kernel-418.113 n'est pas installé.
  Le paquet nvidia-kernel-dkms qui fournit nvidia-kernel-418.113 n'est pas encore configuré.

dpkg: erreur de traitement du paquet nvidia-driver (--configure) :
 problèmes de dépendances - laissé non configuré
Des erreurs ont été rencontrées pendant l'exécution :
 nvidia-kernel-dkms
 nvidia-driver
 


Pas mieux...

Bon arriver la c'est certain il n' y a plus d'espoir, mais je fais quand même les deux dernières commandes demandées:

apt-get upgrade -f


Construction de l'arbre des dépendances      
Lecture des informations d'état... Fait
Calcul de la mise à jour... Fait
0 mis à jour, 0 nouvellement installés, 0 à enlever et 0 non mis à jour.
2 partiellement installés ou enlevés.
Après cette opération, 0 o d'espace disque supplémentaires seront utilisés.
Souhaitez-vous continuer ? [O/n]
Paramétrage de nvidia-kernel-dkms (418.113-1) ...
Removing old nvidia-current-418.113 DKMS files...

------------------------------
Deleting module version: 418.113
completely from the DKMS tree.
------------------------------
Done.
Loading new nvidia-current-418.113 DKMS files...
Building for 4.19.0-9-amd64
Building initial module for 4.19.0-9-amd64
Error! Bad return status for module build on kernel: 4.19.0-9-amd64 (x86_64)
Consult /var/lib/dkms/nvidia-current/418.113/build/make.log for more information.
dpkg: erreur de traitement du paquet nvidia-kernel-dkms (--configure) :
 installed nvidia-kernel-dkms package post-installation script subprocess returned error exit status 10
dpkg: des problèmes de dépendances empêchent la configuration de nvidia-driver :
 nvidia-driver dépend de nvidia-kernel-dkms (= 418.113-1) | nvidia-kernel-418.113 ; cependant :
 Le paquet nvidia-kernel-dkms n'est pas encore configuré.
  Le paquet nvidia-kernel-418.113 n'est pas installé.
  Le paquet nvidia-kernel-dkms qui fournit nvidia-kernel-418.113 n'est pas encore configuré.

dpkg: erreur de traitement du paquet nvidia-driver (--configure) :
 problèmes de dépendances - laissé non configuré
Des erreurs ont été rencontrées pendant l'exécution :
 nvidia-kernel-dkms
 nvidia-driver
E: Sub-process /usr/bin/dpkg returned an error code (1)
 


Toujours pareil sad

Et enfin:

apt update &&  apt upgrade


Atteint :1 http://security.debian.org/debian-security buster/updates InRelease
Atteint :2 http://deb.debian.org/debian buster InRelease
Atteint :3 http://deb.debian.org/debian buster-updates InRelease
Lecture des listes de paquets... Fait
Construction de l'arbre des dépendances      
Lecture des informations d'état... Fait
Tous les paquets sont à jour.
E: Impossible d'ouvrir le fichier verrou /var/lib/dpkg/lock-frontend - open (13: Permission non accordée)
E: Impossible d'obtenir le verrou de dpkg (/var/lib/dpkg/lock-frontend). Avez-vous les droits du superutilisateur ?
alain@mpat-pc:~$ sudo apt update &&  sudo apt upgrade
Atteint :1 http://deb.debian.org/debian buster InRelease
Atteint :2 http://deb.debian.org/debian buster-updates InRelease
Atteint :3 http://security.debian.org/debian-security buster/updates InRelease
Lecture des listes de paquets... Fait
Construction de l'arbre des dépendances      
Lecture des informations d'état... Fait
Tous les paquets sont à jour.
Lecture des listes de paquets... Fait
Construction de l'arbre des dépendances      
Lecture des informations d'état... Fait
Calcul de la mise à jour... Fait
0 mis à jour, 0 nouvellement installés, 0 à enlever et 0 non mis à jour.
2 partiellement installés ou enlevés.
Après cette opération, 0 o d'espace disque supplémentaires seront utilisés.
Souhaitez-vous continuer ? [O/n]
Paramétrage de nvidia-kernel-dkms (418.113-1) ...
Removing old nvidia-current-418.113 DKMS files...

------------------------------
Deleting module version: 418.113
completely from the DKMS tree.
------------------------------
Done.
Loading new nvidia-current-418.113 DKMS files...
Building for 4.19.0-9-amd64
Building initial module for 4.19.0-9-amd64
Error! Bad return status for module build on kernel: 4.19.0-9-amd64 (x86_64)
Consult /var/lib/dkms/nvidia-current/418.113/build/make.log for more information.
dpkg: erreur de traitement du paquet nvidia-kernel-dkms (--configure) :
 installed nvidia-kernel-dkms package post-installation script subprocess returned error exit status 10
dpkg: des problèmes de dépendances empêchent la configuration de nvidia-driver :
 nvidia-driver dépend de nvidia-kernel-dkms (= 418.113-1) | nvidia-kernel-418.113 ; cependant :
 Le paquet nvidia-kernel-dkms n'est pas encore configuré.
  Le paquet nvidia-kernel-418.113 n'est pas installé.
  Le paquet nvidia-kernel-dkms qui fournit nvidia-kernel-418.113 n'est pas encore configuré.

dpkg: erreur de traitement du paquet nvidia-driver (--configure) :
 problèmes de dépendances - laissé non configuré
Des erreurs ont été rencontrées pendant l'exécution :
 nvidia-kernel-dkms
 nvidia-driver
E: Sub-process /usr/bin/dpkg returned an error code (1)
 



Voila, j' y croyais pourtant, à cause du "apt --fix-broken install" que je n'avais pas tenté avant...
Il ne me reste plus qu'a purger "nvidia" et de repasser sur "nouveau" une nouvelle fois.

Merci bien Croutons, si tu as d'autres idées, ou quelqu'un d'autre, n'hésitez pas...Je suis prêt à tout pour installer le pilote nvidia sur debian 10.4 lol
A la nuit prochaine, pour de nouvelles aventures, j'espère ! big_smile

Bonne journée Croutons, bonne journée à tous wink

Dernière modification par alain65 (26-05-2020 01:52:19)


In a world without walls and fences, who needs windows and gates?
A computer is like air conditioning - it becomes useless when you open Windows (L.T)
file-R82e72401f1fc045b22e79ab7e9ca81e8
Quelques une de mes machines

Hors ligne

#19 26-05-2020 08:08:10

Debian Alain
Adhérent(e)
Distrib. : stable / ubuntu / testing
Noyau : Linux 5.6.14 - amd 64
(G)UI : Gnome X.org (X11) / GDM3
Inscription : 11-03-2017

Re : Impossible d'installer nvidia-driver sur debian 10.4 kernel 4.19.0-9

tu as  essayé avec "aptitude" , alain65 ?

-- aptitude (ubuntu.fr) --

-- aptitude (wiki d - f) --

-- aptitude (wikipedia) --

-- aptitude (debian - facile) --

Dernière modification par Debian Alain (26-05-2020 08:10:01)

Hors ligne

#20 26-05-2020 13:58:28

robert2a
Membre
Lieu : France
Distrib. : debian 10
Noyau : 4.19
(G)UI : Gnome
Inscription : 15-11-2014

Re : Impossible d'installer nvidia-driver sur debian 10.4 kernel 4.19.0-9

Bonjour

pour Buster  =>  https://packages.debian.org/fr/buster/nvidia-driver

dans /usr/share/doc/nvidia-driver/README.txt.gz  tu trouvera la liste des cartes compatibles avec ce driver

il a été testé jusqu'au noyau 5   =>  Building the kernel module has been tested up to Linux 5.4.  (je pense que tu a le noyau officiel de buster en 4.9 )

ps: pas de retour du log de la console lors de l'installation , pourtant il donne un éventuel souci lors de l'installation  roll

tu a un souci avec ta debian , ta carte et la version du driver

déjà résoudre ceci (sur un apt update)


E: Impossible d'ouvrir le fichier verrou /var/lib/dpkg/lock-frontend - open (13: Permission non accordée)
E: Impossible d'obtenir le verrou de dpkg (/var/lib/dpkg/lock-frontend). Avez-vous les droits du superutilisateur ?
 



tu n'a pas de compte root ?  , ton sources.list est correct ?

ta carte est a priori celle ci


Subsystem: Gigabyte Technology Co., Ltd GK106 [GeForce GTX 650 Ti] [1458:3618]
 



=>  https://www.hardware.fr/articles/879-2/ … rence.html

sur testing , il y a le driver 340 , le 390  et le nvidia driver (le dernier )
tester le 340 ou le 390   par exemple "nvidia-legacy-340xx-driver"
ce qui donne


apt-get install nvidia-legacy-340xx-driver
 


nota: je n'ai pas de debian buster sous la main

un souci de modules je suis pas étonné


Error! Bad return status for module build on kernel: 4.19.0-9-amd64 (x86_64)
 

Dernière modification par robert2a (26-05-2020 14:09:39)

Hors ligne

#21 27-05-2020 04:44:31

alain65
Membre
Lieu : chelles
Distrib. : Debian GNU/Linux 10
Noyau : Linux 4.19.0-6-amd64 (x86_64)
(G)UI : KDE (kwin)
Inscription : 26-07-2016

Re : Impossible d'installer nvidia-driver sur debian 10.4 kernel 4.19.0-9

Bonjour Debian Alain et Robert2a wink Bonjour à tous. hello2.gif

@ Debian Alain:

Debian Alain a écrit :

tu as  essayé avec "aptitude" , alain65 ?


Non...Car depuis que j'installe des pilotes Nvidia (plusieurs dizaines certainement) sur divers machines avec divers versions de debian (j'ai commencé avec la 6 Squeeze) J'ai toujours utilisé "apt" qui est donné dans les docs et tutos debian pour l'installation des pilotes nvidia et cela a toujours fonctionné.
De plus "aptitude" est en quelque sorte une surcouche d'"apt". Donc tout comme "apt" il utilise "dpkg" pour la gestion des paquets debian.
Il a bien une ergonomie et des fonctions supplémentaires a "apt", mais fondamentalement c'est toujours dpkg qui est utilisé.
Mon problème étant justement quand dpkg est appelé pour faire son boulot d'installation, je ne vois pas très bien en quoi "aptitude" pourrait mieux fonctionner qu' "apt".
Mais si tu me dis que certaines fonctions disponibles sur "aptitude" et pas sur "apt", pourraient me dépanner, alors je suis tout prêt a faire l’essai. Mais auparavant il faudra que tu me dise quelles fonctions, options je devrais utiliser avec "aptitude".
Car si je fais un bête : "aptitude install nvidia-driver" il ne fera rien de plus qu'apt.
J'ai lu les liens que tu as donné, je les connaissais déjà, je n'y ai rien vu pouvant m'aider... hmm



@ Robert2a:

robert2a a écrit :


pour Buster  =>  https://packages.debian.org/fr/buster/nvidia-driver

dans /usr/share/doc/nvidia-driver/README.txt.gz  tu trouvera la liste des cartes compatibles avec ce driver

il a été testé jusqu'au noyau 5   =>  Building the kernel module has been tested up to Linux 5.4.



Alors oui ma carte Nvidia GTX 650 est bien dans la liste, c'est une architecture "Kepler" gravée en 28 nm (nano mètre).
D'ailleurs Nvidia-detect le dit bien:

alain65 a écrit :


alain@mpat-pc:~$ nvidia-detect


Detected NVIDIA GPUs:
01:00.0 VGA compatible controller [0300]: NVIDIA Corporation GK106 [GeForce GTX 650 Ti] [10de:11c6] (rev a1)

Checking card:  NVIDIA Corporation GK106 [GeForce GTX 650 Ti] (rev a1)
Your card is supported by all driver versions.
It is recommended to install the
    nvidia-driver
package.
alain@mpat-pc:~$
 


Et:

alain@mpat-pc:~$ lspci -nnkd::0300



01:00.0 VGA compatible controller [0300]: NVIDIA Corporation GK106 [GeForce GTX 650 Ti] [10de:11c6] (rev a1)
    Subsystem: Gigabyte Technology Co., Ltd GK106 [GeForce GTX 650 Ti] [1458:3618]
    Kernel driver in use: nouveau
    Kernel modules: nouveau
alain@mpat-pc:~$


De plus cette carte graphique était la semaine dernière dans un autre ordi sous debian 10.3 et il n' y avait eu aucun problème pour installer le pilote "nvidia-driver".
C'est uniquement depuis que j'ai installé cette carte sur un nouvel ordi, pour le tester et que j'ai installé sur cet ordi debian 10.4 depuis une iso officielle et contrôlée.
Pour tout vous dire, j'ai meme remis cette carte sur l'ordi en debian 10.3, ça fonctionne nickel. Cela était inutile car je sais bien qu'elle fonctionne bien, car avec "nouveau" sous debian 10.4 elle fonctionne parfaitement.
La seule différence, c'est la version de buster. Dans un cas 10.3 et dans l'autre une fresh installe en 10.4 .

robert2a a écrit :

(je pense que tu a le noyau officiel de buster en 4.9 )


Non, j'ai le 4.19 qui est livré avec l'iso debian 10.4 officiel. Je le dis dans mon titre et à d'autres endroits de ce sujet: Rappel du titre:

Forums
    » Matériel
    » Impossible d'installer nvidia-driver sur debian 10.4 kernel 4.19.0-9


et dans le premier retour de mon premier post:

alain65 a écrit :


Dont voici les principales caractéristiques:

alain@mpat-pc:~$ inxi -Fxx
System:
  Host: mpat-pc Kernel: 4.19.0-9-amd64 x86_64 bits: 64 compiler: gcc
  v: 8.3.0 Desktop: Xfce 4.12.4 tk: Gtk 2.24.32 wm: xfwm4 dm: LightDM
  Distro: Debian GNU/Linux 10 (buster)
.....
....
...
 

Et certainement ailleurs....

robert2a a écrit :


ps: pas de retour du log de la console lors de l'installation , pourtant il donne un éventuel souci lors de l'installation  roll


Si, tout est écris dans mon avant-avant dernier message, vous avez bien insisté pour que je mette tout, j'ai absolument tout mis: https://debian-facile.org/viewtopic.php … 76#p334176. Cliques sur les liens "pastebinit".

robert2a a écrit :


tu a un souci avec ta debian , ta carte et la version du driver


je suis d'accord...Mais lesquels de soucis?

robert2a a écrit :


déjà résoudre ceci (sur un apt update)


E: Impossible d'ouvrir le fichier verrou /var/lib/dpkg/lock-frontend - open (13: Permission non accordée)
E: Impossible d'obtenir le verrou de dpkg (/var/lib/dpkg/lock-frontend). Avez-vous les droits du superutilisateur ?
 


Non, il n' y a rien a résoudre, je n'étais pas en "root" et j'ai oublié un "sudo" après le &&. Si tu regarde bien mon retour, tu verras que juste en dessous, j'ai rectifier la commande et que ça passe bien.
Et puis tiens, le retour d'un update, pour te prouver qu'il n' y a pas de problème, au cas ou tu ne verrais pas  ma commande modifiée avec le sudo manquant:

apt update


Atteint :1 http://deb.debian.org/debian buster InRelease
Réception de :2 http://deb.debian.org/debian buster-updates InRelease [49,3 kB]
Réception de :3 http://security.debian.org/debian-security buster/updates InRelease [65,4 kB]
Réception de :4 http://security.debian.org/debian-security buster/updates/main Sources [122 kB]
236 ko réceptionnés en 1s (241 ko/s)
Lecture des listes de paquets... Fait
Construction de l'arbre des dépendances      
Lecture des informations d'état... Fait
Tous les paquets sont à jour.
root@mpat-pc:~#
 


robert2a a écrit :


tu n'a pas de compte root ?


Si bien sur...Comme tout le monde:

root@mpat-pc:~#


robert2a a écrit :

ton sources.list est correct ?


Je suppose...Sinon vous me l'auriez dit quand debian Alain me l'a demandé:

Debian Alain a écrit :


repositories :

inxi -r


Et ma réponse au cas ou vous n'auriez pas vu l'info:

alain65 a écrit :


Pour terminer avec celles de Debian Alain:

alain@mpat-pc:~$ inxi -r



Repos:     Active apt repos in: /etc/apt/sources.list
           1: deb [url]http://deb.debian.org/debian[/url] buster main contrib non-free
           2: deb-src [url]http://deb.debian.org/debian[/url] buster main
           3: deb [url]http://deb.debian.org/debian[/url] buster-updates main
           4: deb-src [url]http://deb.debian.org/debian[/url] buster-updates main
           5: deb [url]http://security.debian.org/debian-security/[/url] buster/updates main
           6: deb-src [url]http://security.debian.org/debian-security/[/url] buster/updates main
alain@mpat-pc:~$

ici on y voit bien le "non-free" nécessaire pour l'installation du paquet nvidia, que je n'ai pas enlevé pour le remettre juste après.


Franchement je ne vois aucune différence avec la debian que j'ai toujours en 10.3

robert2a a écrit :


ta carte est a priori celle ci


Subsystem: Gigabyte Technology Co., Ltd GK106 [GeForce GTX 650 Ti] [1458:3618]
 


Ce n'est pas "a priori", c'est même certain. wink
je le dis depuis mon premier post...

alain65 a écrit :


alain@mpat-pc:~$ inxi -Fxx
......
.....
...
Graphics:
  Device-1: NVIDIA GK106 [GeForce GTX 650 Ti] vendor: Gigabyte
  driver: nouveau v: kernel bus ID: 01:00.0 chip ID: 10de:11c6
  Display: x11 server: X.Org 1.20.4 driver: modesetting unloaded: fbdev,vesa
  resolution: 1280x1024~60Hz
  OpenGL: renderer: NVE6 v: 4.3 Mesa 18.3.6 direct render: Yes
......
....
...
 


robert2a a écrit :


sur testing , il y a le driver 340 , le 390  et le nvidia driver (le dernier )
tester le 340 ou le 390   par exemple "nvidia-legacy-340xx-driver"
ce qui donne


apt-get install nvidia-legacy-340xx-driver
 


nota: je n'ai pas de debian buster sous la main


C'est pareil sur stable 10.4. Mais bon. comme on sait depuis le début qu'il faut "nvidia-driver", on s'en fout un peu que les 340 et 390 soient disponibles. Non? 
Et même si  j’installais un 340 et que coup de pot il arrive tant bien que mal a faire fonctionner une GTX 650 Ti, pour laquelle il n'est pas prévu.
Cela ne fait pas mon affaire.
Car ce que je veux savoir, comprendre, c'est pourquoi je n'arrive pas à installer "nvidia-driver" qui est LE pilote had hoc pour cette carte graphique sur une debian 10.4 alors qu'avec la même carte ça fonctionne parfaitement sous debian 10.3. 

robert2a a écrit :


un souci de modules je suis pas étonné


Error! Bad return status for module build on kernel: 4.19.0-9-amd64 (x86_64)
 


Bin moi si, je suis étonné, car en 6 ans d'installation de pilotes propriétaire sur debian, je n'ai jamais été confronté a ce problème.
Si tu n'es pas étonné, peut être as tu une solution?
En vous remerciant de passer du temps sur mon problème, je vous souhaite une excellente journée hello.gif

Dernière modification par alain65 (27-05-2020 05:08:14)


In a world without walls and fences, who needs windows and gates?
A computer is like air conditioning - it becomes useless when you open Windows (L.T)
file-R82e72401f1fc045b22e79ab7e9ca81e8
Quelques une de mes machines

Hors ligne

#22 27-05-2020 06:48:07

chalu
Modératrice
Lieu : Anjou
Distrib. : openSUSE Leap 15.1
Noyau : Linux 4.12.14
(G)UI : KDE 5
Inscription : 11-03-2016

Re : Impossible d'installer nvidia-driver sur debian 10.4 kernel 4.19.0-9

Bonjour,
Tu as apporté une info quand même smile

alain65 a écrit :

De plus cette carte graphique était la semaine dernière dans un autre ordi sous debian 10.3 et il n' y avait eu aucun problème pour installer le pilote "nvidia-driver".
C'est uniquement depuis que j'ai installé cette carte sur un nouvel ordi, pour le tester et que j'ai installé sur cet ordi debian 10.4 depuis une iso officielle et contrôlée.


Tu l’avais peut-être dit plus haut, je n’ai pas tout relu ... Il avait quoi comme carte graphique à l’origine ce PC ?

Est-ce que tu as essayé d'installer la version de buster-backports du noyau, headers et driver ?
Pour voir si une version plus récente règle le problème ?
Je crois qu’il faut harmoniser l’origine des paquets, je ne sais pas si ça peut bien fonctionner en gardant le noyau et en-tête de stable et seulement nvidia-driver des backports. Je me souviens avoir lu un mainteneur que c’est ainsi qu’il fallait faire car c'était compilé et testé comme ça.
Robert2a t’en dira sûrement plus.
Purger d’abord tout ce qui concerne le driver Nvidia et redémarrer (sans doute pas utile mais bon vu le bazar ... )
Ajouter les backports au sources.list avec les dépôts main contrib non-free (je te conseillerais bien d’ailleurs d’harmoniser ton sources.list en ajoutant contrib non-free sur toutes les lignes)

deb http://deb.debian.org/debian/ buster-backports main contrib non-free


apt update


Installer noyau et en-tête ensuite

apt -t buster-backports install linux-image-amd64 linux-headers-amd64


Redémarrer pour être sur le nouveau noyau puis installer le driver

apt -t buster-backports install nvidia-driver


en croisant les doigts et redémarrer

Hors ligne

#23 27-05-2020 07:42:44

alain65
Membre
Lieu : chelles
Distrib. : Debian GNU/Linux 10
Noyau : Linux 4.19.0-6-amd64 (x86_64)
(G)UI : KDE (kwin)
Inscription : 26-07-2016

Re : Impossible d'installer nvidia-driver sur debian 10.4 kernel 4.19.0-9

Bonjour Chalu wink

Hmmm...Oui tu es en train de subodorer que la version de nvidia-driver actuelle, celle fournie par les dépôts stable buster, ne serait pas compatible avec le nouveau noyau fourni par la nouvelle iso debian 10.4.
Point de vue intéressant qui recoupe pas mal mes pensées. Je vois bien que le problème pourrait se situer autour de la version du noyau vs nvidia-driver.

Mais avant de tenter l'installation, je vais quand même vérifier, qu'effectivement la version de nvidia-driver des backports non free est bien différentes de celle des dépots stable buster.
Si c'est la même, ça ne sert a rien.

Oui je vais harmoniser les dépôts, mais toi comme moi savons que ça ne changera rien au problème et pendant que j'y serai j'en profiterai pour virer les dépôts de sources.

Si ça fonctionne avec les backports, je pense qu'il faudra bien considérer cela comme un dysfonctionnement de debian 10.4. Mais c'est quand même étrange que je ne vois personne d'autre avec ce problème. Pour ça que je pense que ça vient de chez moi et que le nouveau noyau (4.19) de debian 10.4 n'y est peut être pour rien. 

Sinon concernant la carte graphique:

chalu a écrit :

Bonjour,
Tu l’avais peut-être dit plus haut, je n’ai pas tout relu ... Il avait quoi comme carte graphique à l’origine ce PC ?


Je ne me rappel plus et comme toi la flemme de tout relire roll:D
Sinon ce pc n'avait pas de carte graphique. C'est pour ça que j'ai pris celle de l'autre sous debian 10.3 pour l'essayer. C'est un PC que j'ai reconditionné/réparé , il manquait beaucoup de choses. Je fais ça en permanence, je récupère des épaves à droite et à gauche et je les reconditionne.
Mais j'en suis très content, il marche du tonnerre avec le pilote "nouveau". smile

il est l'heure d'aller dormir pour moi. Je vous dit a samedi matin, je ferai le test avec les backports dans la nuit de vendredi.
Bonne journée Chalu smile


In a world without walls and fences, who needs windows and gates?
A computer is like air conditioning - it becomes useless when you open Windows (L.T)
file-R82e72401f1fc045b22e79ab7e9ca81e8
Quelques une de mes machines

Hors ligne

#24 27-05-2020 12:14:33

chalu
Modératrice
Lieu : Anjou
Distrib. : openSUSE Leap 15.1
Noyau : Linux 4.12.14
(G)UI : KDE 5
Inscription : 11-03-2016

Re : Impossible d'installer nvidia-driver sur debian 10.4 kernel 4.19.0-9

alain65 a écrit :

Oui tu es en train de subodorer que la version de nvidia-driver actuelle, celle fournie par les dépôts stable buster, ne serait pas compatible avec le nouveau noyau fourni par la nouvelle iso debian 10.4.


Non absolument pas, s’il y avait un tel souci de compatibilité, il y aurait plein de retours me semble-t-il.
A mon avis, le souci est lié à ton PC.
Je ne sais pas s’il y a des marqueurs sur le matériel. Peut on prendre une carte fournie sur un PC pour la mettre sur un autre ? Le driver Nvidia peut-il détecter que la carte n'était pas fournie pour ce PC ?
On le peut si on a acheté la carte version boite/complète mais sinon ?
Te proposer de réinstaller ne changera rien, tu l’as déjà fait.
Visiblement tu ne veux pas tester une version legacy du driver donc il reste à tester une version plus récente de nvidia-driver

Hors ligne

#25 27-05-2020 12:22:22

Debian Alain
Adhérent(e)
Distrib. : stable / ubuntu / testing
Noyau : Linux 5.6.14 - amd 64
(G)UI : Gnome X.org (X11) / GDM3
Inscription : 11-03-2017

Re : Impossible d'installer nvidia-driver sur debian 10.4 kernel 4.19.0-9

j'ai pas bien compris , alain65 ,

tu as testé ta carte sur la mme machine sur une buster 10.3 ?

ou sur une machine différente ?

si test fait sur une machine différente , demande toi (fais des tests) si ta C.M. n'est pas h.s.

peu fréquent mais çà m'est arrivé , donc ...

si çà peut  aider ( dans le doute ) ...

c'est quoi ta C.M. ?

dmesg | grep DMI:



inxi -Mxxx


pour en revenir  à aptitude , j'y pense car il répare  souvent les  dépendances cassées .

il gère aussi très bien l'install / reinstall de programmes en cas de soucis de version ou de dépendances .

(la désinstall aussi )

Dernière modification par Debian Alain (27-05-2020 12:33:12)

Hors ligne

Pied de page des forums